glibc-2.3.6

Diskutiere glibc-2.3.6 im Installation & Basiskonfiguration Forum im Bereich Linux/Unix Allgemein; Hallo, wollte glibc-2.3.6 installieren. hab mich nach anleitung durchgeangelt und bekomme beim make diese fehlermeldung also ab hier fangen die...

  1. #1 SubSonniC, 18.01.2007
    Zuletzt bearbeitet: 18.01.2007
    SubSonniC

    SubSonniC Mitglied

    Dabei seit:
    21.10.2006
    Beiträge:
    31
    Zustimmungen:
    0
    Hallo,

    wollte glibc-2.3.6 installieren.
    hab mich nach anleitung durchgeangelt und bekomme beim make diese fehlermeldung

    also ab hier fangen die an
    Weis nich was ich machen soll.
    Wisst Ihr da villeicht mehr?

    Danke schon mal

    Ubuntu 6.06
    Kernel 2.6.15-27-k7
    Gnome




    In file included from ../include/pthread.h:1,
    from ../sysdeps/unix/sysv/linux/fatal-prepare.h:19,
    from assert.c:42:
    /usr/include/pthread.h:163: Fehler: syntax error before »*« token
    /usr/include/pthread.h:165: Fehler: »pthread_create« als Funktion, die eine Funktion zurückgibt, deklariert
    /usr/include/pthread.h:166: Fehler: syntax error before »void«
    /usr/include/pthread.h:169: Fehler: syntax error before »pthread_self«
    /usr/include/pthread.h:172: Fehler: syntax error before »__thread1«
    /usr/include/pthread.h:180: Fehler: syntax error before »__th«
    /usr/include/pthread.h:186: Fehler: syntax error before »__th«
    /usr/include/pthread.h:194: Fehler: syntax error before »*« token
    /usr/include/pthread.h:197: Fehler: syntax error before »*« token
    /usr/include/pthread.h:200: Fehler: syntax error before »*« token
    /usr/include/pthread.h:204: Fehler: syntax error before »*« token
    /usr/include/pthread.h:208: Fehler: syntax error before »*« token
    /usr/include/pthread.h:213: Fehler: syntax error before »*« token
    /usr/include/pthread.h:219: Fehler: syntax error before »*« token
    /usr/include/pthread.h:223: Fehler: syntax error before »*« token
    /usr/include/pthread.h:228: Fehler: syntax error before »*« token
    /usr/include/pthread.h:232: Fehler: syntax error before »*« token
    /usr/include/pthread.h:237: Fehler: syntax error before »*« token
    /usr/include/pthread.h:241: Fehler: syntax error before »*« token
    /usr/include/pthread.h:246: Fehler: syntax error before »*« token
    /usr/include/pthread.h:250: Fehler: syntax error before »*« token
    /usr/include/pthread.h:259: Fehler: syntax error before »*« token
    /usr/include/pthread.h:263: Fehler: syntax error before »*« token
    /usr/include/pthread.h:271: Fehler: syntax error before »*« token
    /usr/include/pthread.h:275: Fehler: syntax error before »*« token
    /usr/include/pthread.h:283: Fehler: syntax error before »*« token
    /usr/include/pthread.h:287: Fehler: syntax error before »*« token
    /usr/include/pthread.h:295: Fehler: syntax error before »__th«
    /usr/include/pthread.h:302: Fehler: syntax error before »__target_thread«
    /usr/include/pthread.h:307: Fehler: syntax error before »__target_thread«
    /usr/include/pthread.h:332: Fehler: syntax error before »*« token
    /usr/include/pthread.h:337: Fehler: syntax error before »*« token
    /usr/include/pthread.h:340: Fehler: syntax error before »*« token
    /usr/include/pthread.h:343: Fehler: syntax error before »*« token
    /usr/include/pthread.h:347: Fehler: syntax error before »*« token
    /usr/include/pthread.h:353: Fehler: syntax error before »*« token
    /usr/include/pthread.h:360: Fehler: syntax error before »*« token
    /usr/include/pthread.h:363: Fehler: syntax error before »*« token
    /usr/include/pthread.h:366: Fehler: syntax error before »*« token
    /usr/include/pthread.h:371: Fehler: syntax error before »*« token
    /usr/include/pthread.h:378: Fehler: syntax error before »*« token
    /usr/include/pthread.h:382: Fehler: syntax error before »*« token
    /usr/include/pthread.h:391: Fehler: syntax error before »*« token
    /usr/include/pthread.h:396: Fehler: syntax error before »*« token
    /usr/include/pthread.h:399: Fehler: syntax error before »*« token
    /usr/include/pthread.h:402: Fehler: syntax error before »*« token
    /usr/include/pthread.h:406: Fehler: syntax error before »*« token
    /usr/include/pthread.h:413: Fehler: syntax error before »*« token
    /usr/include/pthread.h:421: Fehler: syntax error before »*« token
    /usr/include/pthread.h:424: Fehler: syntax error before »*« token
    /usr/include/pthread.h:427: Fehler: syntax error before »*« token
    /usr/include/pthread.h:432: Fehler: syntax error before »*« token
    /usr/include/pthread.h:441: Fehler: syntax error before »*« token
    /usr/include/pthread.h:446: Fehler: syntax error before »*« token
    /usr/include/pthread.h:449: Fehler: syntax error before »*« token
    /usr/include/pthread.h:452: Fehler: syntax error before »*« token
    /usr/include/pthread.h:456: Fehler: syntax error before »*« token
    /usr/include/pthread.h:462: Fehler: syntax error before »*« token
    /usr/include/pthread.h:465: Fehler: syntax error before »*« token
    /usr/include/pthread.h:469: Fehler: syntax error before »*« token
    /usr/include/pthread.h:475: Fehler: syntax error before »*« token
    /usr/include/pthread.h:481: Fehler: syntax error before »*« token
    /usr/include/pthread.h:484: Fehler: syntax error before »*« token
    /usr/include/pthread.h:487: Fehler: syntax error before »*« token
    /usr/include/pthread.h:492: Fehler: syntax error before »*« token
    /usr/include/pthread.h:496: Fehler: syntax error before »*« token
    /usr/include/pthread.h:500: Fehler: syntax error before »*« token
    /usr/include/pthread.h:510: Fehler: syntax error before »*« token
    /usr/include/pthread.h:514: Fehler: syntax error before »*« token
    /usr/include/pthread.h:517: Fehler: syntax error before »*« token
    /usr/include/pthread.h:520: Fehler: syntax error before »*« token
    /usr/include/pthread.h:523: Fehler: syntax error before »*« token
    /usr/include/pthread.h:528: Fehler: syntax error before »*« token
    /usr/include/pthread.h:532: Fehler: syntax error before »*« token
    /usr/include/pthread.h:534: Fehler: syntax error before »*« token
    /usr/include/pthread.h:536: Fehler: syntax error before »*« token
    /usr/include/pthread.h:538: Fehler: syntax error before »*« token
    /usr/include/pthread.h:542: Fehler: syntax error before »*« token
    /usr/include/pthread.h:545: Fehler: syntax error before »*« token
    /usr/include/pthread.h:557: Fehler: syntax error before »*« token
    /usr/include/pthread.h:558: Fehler: syntax error before »)« token
    /usr/include/pthread.h:561: Fehler: syntax error before »__key«
    /usr/include/pthread.h:564: Fehler: syntax error before »__key«
    /usr/include/pthread.h:568: Fehler: syntax error before »__key«
    /usr/include/pthread.h:580: Fehler: syntax error before »*« token
    /usr/include/pthread.h:581: Fehler: syntax error before »)« token
    /usr/include/pthread.h:595: Fehler: syntax error before »__cancelthread«
    /usr/include/pthread.h:653: Fehler: syntax error before »__thread_id«
    make[2]: *** [/home/Data/glibc-build/assert/assert.o] Fehler 1
    make[2]: Verlasse Verzeichnis '/home/Data/glibc-2.3.6/assert'
    make[1]: *** [assert/subdir_lib] Fehler 2
    make[1]: Verlasse Verzeichnis '/home/Data/glibc-2.3.6'
    make: *** [all] Fehler 2
    subsonnic@Univers:/home/Data/glibc-build$
     
  2. #2 Dackel, 18.01.2007
    Zuletzt bearbeitet: 18.01.2007
    Dackel

    Dackel Tripel-As

    Dabei seit:
    06.12.2004
    Beiträge:
    223
    Zustimmungen:
    0
    Ort:
    Berlin
Thema:

glibc-2.3.6