make error bei image viewer

Dieses Thema im Forum "Anwendungen" wurde erstellt von apokalypse_now, 15.02.2004.

  1. #1 apokalypse_now, 15.02.2004
    apokalypse_now

    apokalypse_now Jungspund

    Dabei seit:
    11.02.2004
    Beiträge:
    15
    Zustimmungen:
    0
    so das ist der fehler, hoffe ihr koennt damit etwas anfangen

    Code:
    Compiling module tgadither.o
    Linking modules...print.o: In function `iv_print_to_printer':
    print.o(.text+0x7de): the use of `tempnam' is dangerous, better use `mkstemp'
    /usr/local/lib/libpng.so: undefined reference to `deflate'
    /usr/local/lib/libpng.so: undefined reference to `inflate'
    /usr/local/lib/libpng.so: undefined reference to `inflateInit_'
    /usr/local/lib/libpng.so: undefined reference to `crc32'
    /usr/local/lib/libpng.so: undefined reference to `deflateInit2_'
    /usr/local/lib/libpng.so: undefined reference to `inflateReset'
    /usr/local/lib/libpng.so: undefined reference to `deflateReset'
    /usr/local/lib/libpng.so: undefined reference to `inflateEnd'
    /usr/local/lib/libpng.so: undefined reference to `deflateEnd'
    collect2: ld returned 1 exit status
    gmake[1]: *** [modules] Error 1
    make: *** [all] Error 2
    
     
  2. Anzeige

    Schau dir mal diese Kategorie an. Dort findest du bestimmt etwas.
    Registrieren bzw. einloggen, um diese und auch andere Anzeigen zu deaktivieren
  3. #2 qmasterrr, 15.02.2004
    qmasterrr

    qmasterrr Foren Gott

    Dabei seit:
    01.01.2004
    Beiträge:
    2.735
    Zustimmungen:
    0
    Ort:
    Germany/NRW/Wesel
    hast du vorher ./configure gesagt was sagt das?
     
  4. #3 apokalypse_now, 16.02.2004
    apokalypse_now

    apokalypse_now Jungspund

    Dabei seit:
    11.02.2004
    Beiträge:
    15
    Zustimmungen:
    0
    ./configure sieht so aus

    Code:
    Configuring for platform `Linux'...
    Checking this platform...
    Checking Dependency: i486...
        Preferred (not required) feature `arch-i486' not detected and disabled.
    Checking Dependency: i586...
        Preferred (not required) feature `arch-i586' not detected and disabled.
    Checking Dependency: i686...
        Preferred feature `arch-i686' detected and enabled.
    Checking Dependency: pentiumpro...
        Preferred (not required) feature `arch-pentiumpro' not detected and disabled.
        Preferred feature `title_image' detected and enabled.
    Checking Dependency: libgif-devel...
        Preferred feature `libgif' detected and enabled.
    Checking Dependency: libjpeg-devel...
        Preferred feature `libjpeg' detected and enabled.
    Checking Dependency: libpng-devel...
        Preferred feature `libpng' detected and enabled.
    Checking Dependency: libxpm-devel...
        Preferred feature `libxpm' detected and enabled.
    Checking Dependency: Imlib-devel...
        *** Object `imlib-config' not found in defined platform paths! ***
        Preferred (not required) feature `Imlib' not detected and disabled.
        Preferred feature `Imlib-transpixel-fix' detected and enabled.
    Checking Dependency: xf86vidmode-lib...
    Checking Dependency: xf86vidmode-devel...
        Preferred feature `XF86VidMode' detected and enabled.
    Checking Dependency: gtk-devel...
    Generating output Makefile `iv/Makefile'...
    
    Platform configuration completed!
    --------------------------------------------------------------------------------
    Type 'make all' to compile the program.
    
     
Thema:

make error bei image viewer

Die Seite wird geladen...

make error bei image viewer - Ähnliche Themen

  1. Software Updater Error -> database disk image is malformed

    Software Updater Error -> database disk image is malformed: Hallo, seit gestern bekomme ich kurz nach dem KDE Start folgende Mitteilung: Novell.Zenworks.Zmd.Public.ZenException: database disk image is...
  2. Debian weder Testing noch Stable will (SATA Sil3112/Kernelimageerror)

    Debian weder Testing noch Stable will (SATA Sil3112/Kernelimageerror): Hallo, habe bereits einen Server mit Debian, der einwandfrei funktioniert (naja fast ;)). Nun wollt ich das System auch auf meiner...
  3. postfix - fputs-error

    postfix - fputs-error: Ich hoffe, dass sich wer von euch mit postfix bzw. der Fehlermeldung auskennt. Ich habe nach dem Youtube-Video postfix eingerichtet: [MEDIA] Nun...
  4. journal commit I/O error auf SSD

    journal commit I/O error auf SSD: Hallo zusammen Habe meiner "Sun Ultra 45" (SPARC System) eine 64GB-SSD eingebaut, und dort das OS (Debian 7) installiert. In unregelmässigen...
  5. Kein Sound im Spiel - OpenAL error

    Kein Sound im Spiel - OpenAL error: Ich hab in einem Spiel leider keinen Sound. In der Konsole kommt in einer Endlosschleife immer diese Meldung: OpenAL error: 40964 (Audio_Tick...