Problem mit Wine

nibel

Doppel-As
Beiträge
114
Hat jemand ne Ahnung was diesen fehler verursachen könnte?:

PHP:
wine: creating configuration directory '/home/nibel/.wine'...
X Error of failed request:  BadWindow (invalid Window parameter)
  Major opcode of failed request:  143 (NV-GLX)
  Minor opcode of failed request:  4 ()
  Resource id in failed request:  0x89
  Serial number of failed request:  23
  Current serial number in output stream:  23
wine: wineprefixcreate failed while creating '/home/nibel/.wine'.
wineserver: could not save registry branch to /home/nibel/.wine-0BkIib/system.reg : No su
ch file or directory
wineserver: could not save registry branch to /home/nibel/.wine-0BkIib/user.reg : No such
 file or directory

Er tritt immer auf wenn ich wine <programm> oder winecfg oder sonst etwas mit wine ausführe.
 

NiceDay

Aushilfe
Beiträge
1.314
- Nicht mehr genug Platz auf der Partition (/home) ?
- Keine Schreibrechte im Ordner .wine ?
Ansonsten evtl. Ordner .wine sichern und danach das Original löschen testweise.
 

nibel

Doppel-As
Beiträge
114
Mir wurde gesagt, das es am Grafikkartentreiber liegen müsste.
Platz ist genug, Rechte sind auch in Ordnung.

Also hab ich überlegt, Wine lief bei mir unter Sarge gut also hab ich geguckt welche Version Debian Sarge beutzt und hab mir den Treiber besorgt aber festgestellt, das sich auf meinem System keine Nvidia Treiber mehr bauen lassen.

Der Installer sagt immer building 100% und dann Error: Cannot Build Kernel Module.

die /var/log/nvidia-installer.log

nvidia-installer log file '/var/log/nvidia-installer.log'
creation time: Thu Jan 25 22:25:50 2007

option status:
license pre-accepted : false
update : false
force update : false
expert : false
uninstall : false
driver info : false
no precompiled interface: false
no ncurses color : false
query latest driver ver : false
OpenGL header files : false
no questions : false
silent : false
no backup : false
kernel module only : false
sanity : false
add this kernel : false
no runlevel check : false
no network : false
no ABI note : false
no RPMs : false
force tls : (not specified)
force compat32 tls : (not specified)
X install prefix : /usr/X11R6
OpenGL install prefix : /usr
compat32 install prefix : (not specified)
installer install prefix: /usr
utility install prefix : /usr
kernel name : (not specified)
kernel include path : (not specified)
kernel source path : (not specified)
kernel output path : (not specified)
kernel install path : (not specified)
proc mount point : /proc
ui : (not specified)
tmpdir : /tmp
ftp mirror : ftp://download.nvidia.com
RPM file list : (not specified)

Using: nvidia-installer ncurses user interface
-> License accepted.
-> There appears to already be a driver installed on your system (version: 1.0-
7184). As part of installing this driver (version: 1.0-7174), the existing
driver will be uninstalled. Are you sure you want to continue? ('no' will a
bort installation) (Answer: Yes)
-> No precompiled kernel interface was found to match your kernel; would you li
ke the installer to attempt to download a kernel interface for your kernel f
rom the NVIDIA ftp site (ftp://download.nvidia.com)? (Answer: Yes)
-> No matching precompiled kernel interface was found on the NVIDIA ftp site;
this means that the installer will need to compile a kernel interface for
your kernel.
-> Kernel source path: '/lib/modules/2.6.17.13/source'
-> Performing CC test with CC="cc".
-> Performing rivafb check.
-> Cleaning kernel module build directory.
executing: 'cd ./usr/src/nv; make clean'...
rm -f -f nv.o nv-vm.o os-agp.o os-interface.o os-registry.o nv.o nv-vm.o os-
agp.o os-interface.o os-registry.o nvidia.mod.o
rm -f -f build-in.o nv-linux.o *.d .*.{cmd,flags}
rm -f -f nvidia.{o,ko,mod.{o,c}} nv_compiler.h *~
rm -f -rf .tmp_versions
-> Building kernel module:
executing: 'cd ./usr/src/nv; make module SYSSRC=/lib/modules/2.6.17.13/sourc
e SYSOUT=/lib/modules/2.6.17.13/build'...

NVIDIA: calling KBUILD...
make CC=cc KBUILD_OUTPUT=/lib/modules/2.6.17.13/build KBUILD_VERBOSE=1 -C /l
ib/modules/2.6.17.13/source SUBDIRS=/tmp/selfgz2451/NVIDIA-Linux-x86-1.0-717
4-pkg1/usr/src/nv modules
make -C /lib/modules/2.6.17.13/build \
KBUILD_SRC=/usr/src/linux-2.6.17.13 \
KBUILD_EXTMOD="/tmp/selfgz2451/NVIDIA-Linux-x86-1.0-7174-pkg1/usr/src/nv" -
f /usr/src/linux-2.6.17.13/Makefile modules
mkdir -p /tmp/selfgz2451/NVIDIA-Linux-x86-1.0-7174-pkg1/usr/src/nv/.tmp_vers
ions
rm -f /tmp/selfgz2451/NVIDIA-Linux-x86-1.0-7174-pkg1/usr/src/nv/.tmp_version
s/*
make -f /usr/src/linux-2.6.17.13/scripts/Makefile.build obj=/tmp/selfgz2451/
NVIDIA-Linux-x86-1.0-7174-pkg1/usr/src/nv
echo \#define NV_COMPILER \"`cc -v 2>&1 | tail -n 1`\" > /tmp/selfgz2451/NVI
DIA-Linux-x86-1.0-7174-pkg1/usr/src/nv/nv_compiler.h
cc -Wp,-MD,/tmp/selfgz2451/NVIDIA-Linux-x86-1.0-7174-pkg1/usr/src/nv/.nv.o
.d -nostdinc -isystem /usr/lib/gcc/i486-slackware-linux/3.4.6/include -D__K
ERNEL__ -Iinclude -Iinclude2 -I/usr/src/linux-2.6.17.13/include -include inc
lude/linux/autoconf.h -I/tmp/selfgz2451/NVIDIA-Linux-x86-1.0-7174-pkg1/usr/
src/nv -Wall -Wundef -Wstrict-prototypes -Wno-trigraphs -fno-strict-aliasing
-fno-common -O2 -fomit-frame-pointer -pipe -msoft-float -mpreferred-stack-bo
undary=2 -fno-unit-at-a-time -march=i486 -ffreestanding -I/usr/src/linux-2.6
.17.13/include/asm-i386/mach-default -Iinclude/asm-i386/mach-default -Wdecla
ration-after-statement -I/tmp/selfgz2451/NVIDIA-Linux-x86-1.0-7174-pkg1/usr
/src/nv -Wall -Wimplicit -Wreturn-type -Wswitch -Wformat -Wchar-subscripts -
Wparentheses -Wpointer-arith -Wno-multichar -Werror -O -fno-common -MD -Wsig
n-compare -Wno-cast-qual -Wno-error -D_LOOSE_KERNEL_NAMES -D__KERNEL__ -DMOD
ULE -DNTRM -D_GNU_SOURCE -D_LOOSE_KERNEL_NAMES -D__KERNEL__ -DMODULE -DNV_MA
JOR_VERSION=1 -DNV_MINOR_VERSION=0 -DNV_PATCHLEVEL=7174 -DNV_UNIX -DNV_LINUX
-DNV_INT64_OK -DNVCPU_X86 -UDEBUG -U_DEBUG -DNDEBUG -DNV_MULTIPLE_BRIDGE_AGP
GART_PRESENT -DNV_CHANGE_PAGE_ATTR_PRESENT -DNV_PCI_DISABLE_DEVICE_PRESENT -
DMODULE -D"KBUILD_
STR(s)=#s" -D"KBUILD_BASENAME=KBUILD_STR(nv)" -D"KBUILD_MODNAME=KBUILD_STR(
nvidia)" -c -o /tmp/selfgz2451/NVIDIA-Linux-x86-1.0-7174-pkg1/usr/src/nv/nv.
o /tmp/selfgz2451/NVIDIA-Linux-x86-1.0-7174-pkg1/usr/src/nv/nv.c
In file included from include/linux/list.h:7,
from include/linux/wait.h:23,
from include/asm/semaphore.h:41,
from include/linux/sched.h:20,
from include/linux/module.h:10,
from /tmp/selfgz2451/NVIDIA-Linux-x86-1.0-7174-pkg1/usr/src
/nv/nv-linux.h:46,
from /tmp/selfgz2451/NVIDIA-Linux-x86-1.0-7174-pkg1/usr/src
/nv/nv.c:14:
include/linux/prefetch.h: In function `prefetch_range':
include/linux/prefetch.h:62: Warnung: Zeiger auf Typen »void *« in Arithmeti
k verwendet
In file included from include/linux/dmapool.h:14,
from include/linux/pci.h:559,
from /tmp/selfgz2451/NVIDIA-Linux-x86-1.0-7174-pkg1/usr/src
/nv/nv-linux.h:69,
from /tmp/selfgz2451/NVIDIA-Linux-x86-1.0-7174-pkg1/usr/src
/nv/nv.c:14:
include/asm/io.h: In function `check_signature':
include/asm/io.h:246: Warnung: Argument falschen Typs für Inkrementierung
In Datei, eingefügt von /tmp/selfgz2451/NVIDIA-Linux-x86-1.0-7174-pkg1/usr/s
rc/nv/nv.c:14:
/tmp/selfgz2451/NVIDIA-Linux-x86-1.0-7174-pkg1/usr/src/nv/nv-linux.h:241:5:
Warnung: »NV_ENABLE_MEM_TRACKING« ist nicht definiert
/tmp/selfgz2451/NVIDIA-Linux-x86-1.0-7174-pkg1/usr/src/nv/nv-linux.h:269:5:
Warnung: »NV_ENABLE_MEM_TRACKING« ist nicht definiert
/tmp/selfgz2451/NVIDIA-Linux-x86-1.0-7174-pkg1/usr/src/nv/nv-linux.h:691:2:
Warnung: #warning "conftest.sh failed, assuming remap_page_range(4)!"
/tmp/selfgz2451/NVIDIA-Linux-x86-1.0-7174-pkg1/usr/src/nv/nv.c: At top level
:
/tmp/selfgz2451/NVIDIA-Linux-x86-1.0-7174-pkg1/usr/src/nv/nv.c:201: Warnung:
Initialisierung von inkompatiblem Zeigertyp
/tmp/selfgz2451/NVIDIA-Linux-x86-1.0-7174-pkg1/usr/src/nv/nv.c:223:5: Warnun
g: »NV_ENABLE_MEM_TRACKING« ist nicht definiert
/tmp/selfgz2451/NVIDIA-Linux-x86-1.0-7174-pkg1/usr/src/nv/nv.c: In function
`nvos_get_agp_device_by_class':
/tmp/selfgz2451/NVIDIA-Linux-x86-1.0-7174-pkg1/usr/src/nv/nv.c:404: Warnung:
implizite Deklaration der Funktion »pci_find_class«
/tmp/selfgz2451/NVIDIA-Linux-x86-1.0-7174-pkg1/usr/src/nv/nv.c:404: Warnung:
Zuweisung erzeugt Zeiger von Ganzzahl ohne Typkonvertierung
/tmp/selfgz2451/NVIDIA-Linux-x86-1.0-7174-pkg1/usr/src/nv/nv.c:418: Warnung:
Zuweisung erzeugt Zeiger von Ganzzahl ohne Typkonvertierung
/tmp/selfgz2451/NVIDIA-Linux-x86-1.0-7174-pkg1/usr/src/nv/nv.c: In function
`nvidia_init_module':
/tmp/selfgz2451/NVIDIA-Linux-x86-1.0-7174-pkg1/usr/src/nv/nv.c:970: Warnung:
implizite Deklaration der Funktion »pm_register«
/tmp/selfgz2451/NVIDIA-Linux-x86-1.0-7174-pkg1/usr/src/nv/nv.c:970: Warnung:
Zuweisung erzeugt Zeiger von Ganzzahl ohne Typkonvertierung
/tmp/selfgz2451/NVIDIA-Linux-x86-1.0-7174-pkg1/usr/src/nv/nv.c:1036: Warnung
: implizite Deklaration der Funktion »pm_unregister«
/tmp/selfgz2451/NVIDIA-Linux-x86-1.0-7174-pkg1/usr/src/nv/nv.c:1167:5: Warnu
ng: »NV_ENABLE_MEM_TRACKING« ist nicht definiert
/tmp/selfgz2451/NVIDIA-Linux-x86-1.0-7174-pkg1/usr/src/nv/nv.c: In function
`nv_kern_mmap':
/tmp/selfgz2451/NVIDIA-Linux-x86-1.0-7174-pkg1/usr/src/nv/nv.c:1541: Warnung
: implizite Deklaration der Funktion »remap_page_range«
/tmp/selfgz2451/NVIDIA-Linux-x86-1.0-7174-pkg1/usr/src/nv/nv.c: In function
`nvos_count_devices':
/tmp/selfgz2451/NVIDIA-Linux-x86-1.0-7174-pkg1/usr/src/nv/nv.c:3232: Warnung
: Zuweisung erzeugt Zeiger von Ganzzahl ohne Typkonvertierung
/tmp/selfgz2451/NVIDIA-Linux-x86-1.0-7174-pkg1/usr/src/nv/nv.c:3237: Warnung
: Zuweisung erzeugt Zeiger von Ganzzahl ohne Typkonvertierung
cc -Wp,-MD,/tmp/selfgz2451/NVIDIA-Linux-x86-1.0-7174-pkg1/usr/src/nv/.nv-v
m.o.d -nostdinc -isystem /usr/lib/gcc/i486-slackware-linux/3.4.6/include -D
__KERNEL__ -Iinclude -Iinclude2 -I/usr/src/linux-2.6.17.13/include -include
include/linux/autoconf.h -I/tmp/selfgz2451/NVIDIA-Linux-x86-1.0-7174-pkg1/u
sr/src/nv -Wall -Wundef -Wstrict-prototypes -Wno-trigraphs
-fno-strict-aliasing -fno-common -O2 -fomit-frame-pointer -pipe -msoft-float
-mpreferred-stack-boundary=2 -fno-unit-at-a-time -march=i486 -ffreestanding
-I/usr/src/linux-2.6.17.13/include/asm-i386/mach-default -Iinclude/asm-i386/
mach-default -Wdeclaration-after-statement -I/tmp/selfgz2451/NVIDIA-Linux-x
86-1.0-7174-pkg1/usr/src/nv -Wall -Wimplicit -Wreturn-type -Wswitch -Wformat
-Wchar-subscripts -Wparentheses -Wpointer-arith -Wno-multichar -Werror -O -f
no-common -MD -Wsign-compare -Wno-cast-qual -Wno-error -D_LOOSE_KERNEL_NAMES
-D__KERNEL__ -DMODULE -DNTRM -D_GNU_SOURCE -D_LOOSE_KERNEL_NAMES -D__KERNEL_
_ -DMODULE -DNV_MAJOR_VERSION=1 -DNV_MINOR_VERSION=0 -DNV_PATCHLEVEL=7174 -D
NV_UNIX -DNV_LINUX -DNV_INT64_OK -DNVCPU_X86 -UDEBUG -U_DEBUG -DNDEBUG -DNV_
MULTIPLE_BRIDGE_AGPGART_PRESENT -DNV_CHANGE_PAGE_ATTR_PRESENT -DNV_PCI_DISAB
LE_DEVICE_PRESENT -DMODULE -D"KBUILD_STR(s)=#s" -D"KBUILD_BASENAME=KBUILD_ST
R(nv_vm)" -D"KBUILD_MODNAME=KBUILD_STR(nvidia)" -c -o /tmp/selfgz2451/NVIDI
A-Linux-x86-1.0-7174-pkg1/usr/src
/nv/nv-vm.o /tmp/selfgz2451/NVIDIA-Linux-x86-1.0-7174-pkg1/usr/src/nv/nv-vm.
c
In file included from include/linux/list.h:7,
from include/linux/wait.h:23,
from include/asm/semaphore.h:41,
from include/linux/sched.h:20,
from include/linux/module.h:10,
from /tmp/selfgz2451/NVIDIA-Linux-x86-1.0-7174-pkg1/usr/src
/nv/nv-linux.h:46,
from /tmp/selfgz2451/NVIDIA-Linux-x86-1.0-7174-pkg1/usr/src
/nv/nv-vm.c:14:
include/linux/prefetch.h: In function `prefetch_range':
include/linux/prefetch.h:62: Warnung: Zeiger auf Typen »void *« in Arithmeti
k verwendet
In file included from include/linux/dmapool.h:14,
from include/linux/pci.h:559,
from /tmp/selfgz2451/NVIDIA-Linux-x86-1.0-7174-pkg1/usr/src
/nv/nv-linux.h:69,
from /tmp/selfgz2451/NVIDIA-Linux-x86-1.0-7174-pkg1/usr/src
/nv/nv-vm.c:14:
include/asm/io.h: In function `check_signature':
include/asm/io.h:246: Warnung: Argument falschen Typs für Inkrementierung
In Datei, eingefügt von /tmp/selfgz2451/NVIDIA-Linux-x86-1.0-7174-pkg1/usr/s
rc/nv/nv-vm.c:14:
/tmp/selfgz2451/NVIDIA-Linux-x86-1.0-7174-pkg1/usr/src/nv/nv-linux.h:241:5:
Warnung: »NV_ENABLE_MEM_TRACKING« ist nicht definiert
/tmp/selfgz2451/NVIDIA-Linux-x86-1.0-7174-pkg1/usr/src/nv/nv-linux.h:269:5:
Warnung: »NV_ENABLE_MEM_TRACKING« ist nicht definiert
/tmp/selfgz2451/NVIDIA-Linux-x86-1.0-7174-pkg1/usr/src/nv/nv-linux.h:691:2:
Warnung: #warning "conftest.sh failed, assuming remap_page_range(4)!"
cc -Wp,-MD,/tmp/selfgz2451/NVIDIA-Linux-x86-1.0-7174-pkg1/usr/src/nv/.os-a
gp.o.d -nostdinc -isystem /usr/lib/gcc/i486-slackware-linux/3.4.6/include -
D__KERNEL__ -Iinclude -Iinclude2 -I/usr/src/linux-2.6.17.13/include -include
include/linux/autoconf.h -I/tmp/selfgz2451/NVIDIA-Linux-x86-1.0-7174-pkg1/u
sr/src/nv -Wall -Wundef -Wstrict-prototypes -Wno-trigraphs -fno-strict-alias
ing -fno-common -O2 -fomit-frame-pointer -pipe -msoft-float -mpreferred-stac
k-boundary=2 -fno-unit-at-a-time -m
arch=i486 -ffreestanding -I/usr/src/linux-2.6.17.13/include/asm-i386/mach-de
fault -Iinclude/asm-i386/mach-default -Wdeclaration-after-statement -I/tmp/
selfgz2451/NVIDIA-Linux-x86-1.0-7174-pkg1/usr/src/nv -Wall -Wimplicit -Wretu
rn-type -Wswitch -Wformat -Wchar-subscripts -Wparentheses -Wpointer-arith -W
no-multichar -Werror -O -fno-common -MD -Wsign-compare -Wno-cast-qual -Wno-e
rror -D_LOOSE_KERNEL_NAMES -D__KERNEL__ -DMODULE -DNTRM -D_GNU_SOURCE -D_LOO
SE_KERNEL_NAMES -D__KERNEL__ -DMODULE -DNV_MAJOR_VERSION=1 -DNV_MINOR_VERSIO
N=0 -DNV_PATCHLEVEL=7174 -DNV_UNIX -DNV_LINUX -DNV_INT64_OK -DNVCPU_X86 -UDE
BUG -U_DEBUG -DNDEBUG -DNV_MULTIPLE_BRIDGE_AGPGART_PRESENT -DNV_CHANGE_PAGE_
ATTR_PRESENT -DNV_PCI_DISABLE_DEVICE_PRESENT -DMODULE -D"KBUILD_STR(s)=#s" -
D"KBUILD_BASENAME=KBUILD_STR(os_agp)" -D"KBUILD_MODNAME=KBUILD_STR(nvidia)"
-c -o /tmp/selfgz2451/NVIDIA-Linux-x86-1.0-7174-pkg1/usr/src/nv/os-agp.o /tm
p/selfgz2451/NVIDIA-Linux-x86-1.0-7174-pkg1/usr/src/nv/os-agp.c
In file included from include/linux/list.h:7,
from include/linux/wait.h:23,
from include/asm/semaphore.h:41,
from include/linux/sched.h:20,
from include/linux/module.h:10,
from /tmp/selfgz2451/NVIDIA-Linux-x86-1.0-7174-pkg1/usr/src
/nv/nv-linux.h:46,
from /tmp/selfgz2451/NVIDIA-Linux-x86-1.0-7174-pkg1/usr/src
/nv/os-agp.c:24:
include/linux/prefetch.h: In function `prefetch_range':
include/linux/prefetch.h:62: Warnung: Zeiger auf Typen »void *« in Arithmeti
k verwendet
In file included from include/linux/dmapool.h:14,
from include/linux/pci.h:559,
from /tmp/selfgz2451/NVIDIA-Linux-x86-1.0-7174-pkg1/usr/src
/nv/nv-linux.h:69,
from /tmp/selfgz2451/NVIDIA-Linux-x86-1.0-7174-pkg1/usr/src
/nv/os-agp.c:24:
include/asm/io.h: In function `check_signature':
include/asm/io.h:246: Warnung: Argument falschen Typs für Inkrementierung
In Datei, eingefügt von /tmp/selfgz2451/NVIDIA-Linux-x86-1.0-7174-pkg1/usr/s
rc/nv/os-agp.c:24:
/tmp/selfgz2451/NVIDIA-Linux-x86-1.0-7174-pkg1/usr/src/nv/nv-linux.h:241:5:
Warnung: »NV_ENABLE_MEM_TRACKING« ist nicht definiert
/tmp/selfgz2451/NVIDIA-Linux-x86-1.0-7174-pkg1/usr/src/nv/nv-linux.h:269:5:
Warnung: »NV_ENABLE_MEM_TRACKING« ist nicht definiert
/tmp/selfgz2451/NVIDIA-Linux-x86-1.0-7174-pkg1/usr/src/nv/nv-linux.h:691:2:
Warnung: #warning "conftest.sh failed, assuming remap_page_range(4)!"
cc -Wp,-MD,/tmp/selfgz2451/NVIDIA-Linux-x86-1.0-7174-pkg1/usr/src/nv/.os-i
nterface.o.d -nostdinc -isystem /usr/lib/gcc/i486-slackware-linux/3.4.6/inc
lude -D__KERNEL__ -Iinclude -Iinclude2 -I/usr/src/linux-2.6.17.13/include -i
nclude include/linux/autoconf.h -I/tmp/selfgz2451/NVIDIA-Linux-x86-1.0-7174
-pkg1/usr/src/nv -Wall -Wundef -Wstrict-prototypes -Wno-trigraphs -fno-stric
t-aliasing -fno-common -O2 -fomit-frame-pointer -pipe -msoft-float -mpreferr
ed-stack-boundary=2 -fno-unit-at-a-time -march=i486 -ffreestanding -I/usr/sr
c/linux-2.6.17.13/include/asm-i386/mach-default -Iinclude/asm-i386/mach-defa
ult -W
declaration-after-statement -I/tmp/selfgz2451/NVIDIA-Linux-x86-1.0-7174-pkg
1/usr/src/nv -Wall -Wimplicit -Wreturn-type -Wswitch -Wformat -Wchar-subscri
pts -Wparentheses -Wpointer-arith -Wno-multichar -Werror -O -fno-common -MD
-Wsign-compare -Wno-cast-qual -Wno-error -D_LOOSE_KERNEL_NAMES -D__KERNEL__
-DMODULE -DNTRM -D_GNU_SOURCE -D_LOOSE_KERNEL_NAMES -D__KERNEL__ -DMODULE -D
NV_MAJOR_VERSION=1 -DNV_MINOR_VERSION=0 -DNV_PATCHLEVEL=7174 -DNV_UNIX -DNV_
LINUX -DNV_INT64_OK -DNVCPU_X86 -UDEBUG -U_DEBUG -DNDEBUG -DNV_MULTIPLE_BRID
GE_AGPGART_PRESENT -DNV_CHANGE_PAGE_ATTR_PRESENT -DNV_PCI_DISABLE_DEVICE_PRE
SENT -DMODULE -D"KBUILD_STR(s)=#s" -D"KBUILD_BASENAME=KBUILD_STR(os_interfac
e)" -D"KBUILD_MODNAME=KBUILD_STR(nvidia)" -c -o /tmp/selfgz2451/NVIDIA-Linu
x-x86-1.0-7174-pkg1/usr/src/nv/os-interface.o /tmp/selfgz2451/NVIDIA-Linux-x
86-1.0-7174-pkg1/usr/src/nv/os-interface.c
In file included from include/linux/list.h:7,
from include/linux/wait.h:23,
from include/asm/semaphore.h:41,
from include/linux/sched.h:20,
from include/linux/module.h:10,
from /tmp/selfgz2451/NVIDIA-Linux-x86-1.0-7174-pkg1/usr/src
/nv/nv-linux.h:46,
from /tmp/selfgz2451/NVIDIA-Linux-x86-1.0-7174-pkg1/usr/src
/nv/os-interface.c:26:
include/linux/prefetch.h: In function `prefetch_range':
include/linux/prefetch.h:62: Warnung: Zeiger auf Typen »void *« in Arithmeti
k verwendet
In file included from include/linux/dmapool.h:14,
from include/linux/pci.h:559,
from /tmp/selfgz2451/NVIDIA-Linux-x86-1.0-7174-pkg1/usr/src
/nv/nv-linux.h:69,
from /tmp/selfgz2451/NVIDIA-Linux-x86-1.0-7174-pkg1/usr/src
/nv/os-interface.c:26:
include/asm/io.h: In function `check_signature':
include/asm/io.h:246: Warnung: Argument falschen Typs für Inkrementierung
In Datei, eingefügt von /tmp/selfgz2451/NVIDIA-Linux-x86-1.0-7174-pkg1/usr/s
rc/nv/os-interface.c:26:
/tmp/selfgz2451/NVIDIA-Linux-x86-1.0-7174-pkg1/usr/src/nv/nv-linux.h:241:5:
Warnung: »NV_ENABLE_MEM_TRACKING« ist nicht definiert
/tmp/selfgz2451/NVIDIA-Linux-x86-1.0-7174-pkg1/usr/src/nv/nv-linux.h:269:5:
Warnung: »NV_ENABLE_MEM_TRACKING« ist nicht definiert
/tmp/selfgz2451/NVIDIA-Linux-x86-1.0-7174-pkg1/usr/src/nv/nv-linux.h:691:2:
Warnung: #warning "conftest.sh failed, assuming remap_page_range(4)!"
/tmp/selfgz2451/NVIDIA-Linux-x86-1.0-7174-pkg1/usr/src/nv/os-interface.c:667
:5: Warnung: »DEBUG« ist nicht definiert
/tmp/selfgz2451/NVIDIA-Linux-x86-1.0-7174-pkg1/usr/src/nv/os-interface.c:679
:5: Warnung: »DEBUG« ist nicht definiert
/tmp/selfgz2451/NVIDIA-Linux-x86-1.0-7174-pkg1/usr/src/nv/os-interface.c: In
function `os_set_mlock_capability':
/tmp/selfgz2451/NVIDIA-Linux-x86-1.0-7174-pkg1/usr/src/nv/os-interface.c:126
2: Fehler: structure hat kein Element namens »rlim«
make[4]: *** [/tmp/selfgz2451/NVIDIA-Linux-x86-1.0-7174-pkg1/usr/src/nv/os-i
nterface.o] Fehler 1
make[3]: *** [_module_/tmp/selfgz2451/NVIDIA-Linux-x86-1.0-7174-pkg1/usr/src
/nv] Fehler 2
make[2]: *** [modules] Fehler 2
NVIDIA: left KBUILD.
nvidia.ko failed to build!
make[1]: *** [module] Fehler 1
make: *** [module] Fehler 2
-> Error.
ERROR: Unable to build the NVIDIA kernel module.
ERROR: Installation has failed. Please see the file
'/var/log/nvidia-installer.log' for details. You may find suggestions
on fixing installation problems in the README available on the Linux
driver download page at www.nvidia.com.
 
Zuletzt bearbeitet:

NiceDay

Aushilfe
Beiträge
1.314
Ja, ich würde natürlich den eigenen von NV nutzen (glaub 93xx ist der neueste), hilft das denn?
 

nibel

Doppel-As
Beiträge
114
Ich hab mir den Treiber von nvidia.de geholt mit der Versionsnummer die auch in Sarge verwendet wird. Problem ist, das sich plötzlich überhaupt keine Treiber mehr bauen lassen mit dem Installer von Nvidia.
 

z00k

I love my slack! Do u?
Beiträge
302
du solltest mal den aktuellsten treiber fuer deine karte verwenden...

zu beachten ist, dass der neuste nvidia treiber nicht mehr alle nvidia karten unterstuetzt...

1.0-9746 README

PS:
wenn du ne logfile oder aehnliches postest, das naechste mal bitte in einen 'CODE' block...



gReetZ
 

Ähnliche Themen

Zugriff Ubuntu 16.04. auf Freigabe 18.04. LTS nicht möglich

Samba 4 Gast Zugang unter Ubuntu funktioniert nicht

X startet nichtmehr

Windows clients können nicht mehr auf lange laufendes System zugreifen

Falsche Rechte gesetzt beim Anlegen von Ordnern via Samba-Client

Oben