kernel

Diskutiere kernel im Debian/Ubuntu/Knoppix Forum im Bereich Linux Distributionen; brauch ich was besonderes um bei debian den kernel zu kompiliern?bei mir brichts immer mit ner fehlermeldung ab. mfg, zero

  1. #1 zeromaster, 05.01.2004
    zeromaster

    zeromaster asus cuv4x-d zerstörer

    Dabei seit:
    07.12.2003
    Beiträge:
    81
    Zustimmungen:
    0
    Ort:
    Wien
    brauch ich was besonderes um bei debian den kernel zu kompiliern?bei mir brichts immer mit ner fehlermeldung ab.
    mfg,
    zero
     
  2. Anzeige

    Schau dir mal diese Kategorie an. Dort findest du bestimmt etwas.
    Registrieren bzw. einloggen, um diese und auch andere Anzeigen zu deaktivieren
  3. #2 h2owasser, 05.01.2004
    h2owasser

    h2owasser Sxe Power User

    Dabei seit:
    07.12.2002
    Beiträge:
    491
    Zustimmungen:
    0
    Mit was für einer Fehlermeldung, welcher kernel usw. ?
     
  4. #3 zeromaster, 05.01.2004
    zeromaster

    zeromaster asus cuv4x-d zerstörer

    Dabei seit:
    07.12.2003
    Beiträge:
    81
    Zustimmungen:
    0
    Ort:
    Wien
    also der kernel ist der 2.6er von meinem geburtstag (18.12).die fehlermeldungen kommn gleich am anfang bei make menuconfig od. make oldconfig
     
  5. #4 damager, 05.01.2004
    damager

    damager Moderator

    Dabei seit:
    27.08.2003
    Beiträge:
    3.065
    Zustimmungen:
    0
    Ort:
    Munich
    *augenreib*
    welchen fehlermeldung??? bin ich blind oder hast du vergessen diese zu posten?
     
  6. #5 zeromaster, 05.01.2004
    zeromaster

    zeromaster asus cuv4x-d zerstörer

    Dabei seit:
    07.12.2003
    Beiträge:
    81
    Zustimmungen:
    0
    Ort:
    Wien
    Code:
    testdebian:/home/zeromaster/kernel/linux-2.6.0# make menuconfig
      HOSTCC  scripts/fixdep
    scripts/fixdep.c:97:23: sys/types.h: No such file or directory
    scripts/fixdep.c:98:22: sys/stat.h: No such file or directory
    scripts/fixdep.c:99:22: sys/mman.h: No such file or directory
    scripts/fixdep.c:100:20: unistd.h: No such file or directory
    scripts/fixdep.c:101:19: fcntl.h: No such file or directory
    scripts/fixdep.c:102:20: string.h: No such file or directory
    scripts/fixdep.c:103:20: stdlib.h: No such file or directory
    scripts/fixdep.c:104:19: stdio.h: No such file or directory
    In file included from /usr/lib/gcc-lib/i486-linux/3.3.3/include/syslimits.h:7,
                     from /usr/lib/gcc-lib/i486-linux/3.3.3/include/limits.h:11,
                     from scripts/fixdep.c:105:
    /usr/lib/gcc-lib/i486-linux/3.3.3/include/limits.h:122:75: limits.h: No such file or directory
    scripts/fixdep.c:106:19: ctype.h: No such file or directory
    scripts/fixdep.c:107:24: netinet/in.h: No such file or directory
    scripts/fixdep.c: In function `usage':
    scripts/fixdep.c:121: warning: implicit declaration of function `fprintf'
    scripts/fixdep.c:121: error: `stderr' undeclared (first use in this function)
    scripts/fixdep.c:121: error: (Each undeclared identifier is reported only once
    scripts/fixdep.c:121: error: for each function it appears in.)
    scripts/fixdep.c:122: warning: implicit declaration of function `exit'
    scripts/fixdep.c: In function `print_cmdline':
    scripts/fixdep.c:127: warning: implicit declaration of function `printf'
    scripts/fixdep.c: At top level:
    scripts/fixdep.c:130: error: `NULL' undeclared here (not in a function)
    scripts/fixdep.c: In function `grow_config':
    scripts/fixdep.c:143: warning: implicit declaration of function `realloc'
    scripts/fixdep.c:143: warning: assignment makes pointer from integer without a cast
    scripts/fixdep.c:144: error: `NULL' undeclared (first use in this function)
    scripts/fixdep.c:145: warning: implicit declaration of function `perror'
    scripts/fixdep.c: In function `is_defined_config':
    scripts/fixdep.c:161: warning: implicit declaration of function `memcmp'
    scripts/fixdep.c: In function `define_config':
    scripts/fixdep.c:174: warning: implicit declaration of function `memcpy'
    scripts/fixdep.c: In function `use_config':
    scripts/fixdep.c:193: error: `PATH_MAX' undeclared (first use in this function)
    scripts/fixdep.c:207: warning: implicit declaration of function `tolower'
    scripts/fixdep.c:193: warning: unused variable `s'
    scripts/fixdep.c: At top level:
    scripts/fixdep.c:212: error: syntax error before "size_t"
    scripts/fixdep.c:213: warning: function declaration isn't a prototype
    scripts/fixdep.c: In function `parse_config_file':
    scripts/fixdep.c:214: error: `map' undeclared (first use in this function)
    scripts/fixdep.c:214: error: `len' undeclared (first use in this function)
    scripts/fixdep.c:220: warning: implicit declaration of function `ntohl'
    scripts/fixdep.c:231: warning: implicit declaration of function `isalnum'
    scripts/fixdep.c: In function `strrcmp':
    scripts/fixdep.c:244: warning: implicit declaration of function `strlen'
    scripts/fixdep.c: In function `do_config_file':
    scripts/fixdep.c:255: error: storage size of `st' isn't known
    scripts/fixdep.c:259: warning: implicit declaration of function `open'
    scripts/fixdep.c:259: error: `O_RDONLY' undeclared (first use in this function)
    scripts/fixdep.c:261: error: `stderr' undeclared (first use in this function)
    scripts/fixdep.c:265: warning: implicit declaration of function `fstat'
    scripts/fixdep.c:267: warning: implicit declaration of function `close'
    scripts/fixdep.c:270: warning: implicit declaration of function `mmap'
    scripts/fixdep.c:270: error: `NULL' undeclared (first use in this function)
    scripts/fixdep.c:270: error: `PROT_READ' undeclared (first use in this function)scripts/fixdep.c:270: error: `MAP_PRIVATE' undeclared (first use in this function)
    scripts/fixdep.c:270: warning: assignment makes pointer from integer without a cast
    scripts/fixdep.c:279: warning: implicit declaration of function `munmap'
    scripts/fixdep.c:255: warning: unused variable `st'
    scripts/fixdep.c: At top level:
    scripts/fixdep.c:284: error: syntax error before "size_t"
    scripts/fixdep.c:285: warning: function declaration isn't a prototype
    scripts/fixdep.c: In function `parse_dep_file':
    scripts/fixdep.c:286: error: `map' undeclared (first use in this function)
    scripts/fixdep.c:287: error: `len' undeclared (first use in this function)
    scripts/fixdep.c:289: error: `PATH_MAX' undeclared (first use in this function)
    scripts/fixdep.c:291: warning: implicit declaration of function `strchr'
    scripts/fixdep.c:293: error: `stderr' undeclared (first use in this function)
    scripts/fixdep.c:289: warning: unused variable `s'
    scripts/fixdep.c: In function `print_deps':
    scripts/fixdep.c:325: error: storage size of `st' isn't known
    scripts/fixdep.c:329: error: `O_RDONLY' undeclared (first use in this function)
    scripts/fixdep.c:331: error: `stderr' undeclared (first use in this function)
    scripts/fixdep.c:341: error: `NULL' undeclared (first use in this function)
    scripts/fixdep.c:341: error: `PROT_READ' undeclared (first use in this function)scripts/fixdep.c:341: error: `MAP_PRIVATE' undeclared (first use in this function)
    scripts/fixdep.c:341: warning: assignment makes pointer from integer without a cast
    scripts/fixdep.c:325: warning: unused variable `st'
    scripts/fixdep.c: In function `traps':
    scripts/fixdep.c:360: error: `stderr' undeclared (first use in this function)
    make[1]: *** [scripts/fixdep] Error 1
    make: *** [scripts/fixdep] Error 2
     
  7. #6 h2owasser, 06.01.2004
    h2owasser

    h2owasser Sxe Power User

    Dabei seit:
    07.12.2002
    Beiträge:
    491
    Zustimmungen:
    0
    Also die Fehlermeldung sieht mir sehr komisch aus. Ist der Kernel richtig entpackt ? Allgemein weiß ich, das man bei debian die ncurses nachinstallieren muß.
     
  8. #7 Apulanta, 06.01.2004
    Apulanta

    Apulanta Moderatorte

    Dabei seit:
    16.05.2003
    Beiträge:
    434
    Zustimmungen:
    0
    Ort:
    HH
    Hast du denn das alles?

    kernel-package
    libdb3-dev
    libncurses5-dev
    debhelper
    html2text
    debconf-utils
    fakeroot
     
  9. Anzeige

    Vielleicht findest du HIER Antworten.
    Registrieren bzw. einloggen, um diese und auch andere Anzeigen zu deaktivieren
  10. Steve

    Steve 13te

    Dabei seit:
    13.04.2002
    Beiträge:
    381
    Zustimmungen:
    0
    dir fehlen irgendwelche header Dateien. libc6-dev installiert?

    Steve
     
  11. #9 zeromaster, 10.01.2004
    zeromaster

    zeromaster asus cuv4x-d zerstörer

    Dabei seit:
    07.12.2003
    Beiträge:
    81
    Zustimmungen:
    0
    Ort:
    Wien
    naja,das problem erübrgt sich indem man entscheid auch den kernel2.6.0_1 als image anzubieten.naja, danke für eure mühe,zurzeit hab ich grösere probleme als ein nichtselbstkompilierter kernel.
    mfg,
    zeromaster
     
Thema:

kernel

Die Seite wird geladen...

kernel - Ähnliche Themen

  1. CentOS + kernel +closed Source?

    CentOS + kernel +closed Source?: Hallo ich möchte wissen (deutschsprachig) ob der Kernel von CentOS 7.3.1611 closed Source ist?
  2. Gigabit PCI Ethernet Card welche unter Kernel 3.16 läuft?

    Gigabit PCI Ethernet Card welche unter Kernel 3.16 läuft?: Hallo zusammen Bezüglich diesem Problem habe ich nun eine neue PCI Gigabit Ethernet Card gekauft, jedoch zeigt mit lspci REIN GAR NIX an!! ->...
  3. OpenJDK8 unter Debian7.11/sparc64/kernel 3.16 kompilieren

    OpenJDK8 unter Debian7.11/sparc64/kernel 3.16 kompilieren: Hallo zusammen Habe vor das OpenJDK8 unter Debian 7.11 (mit Kernel 3.16.x aus wheezy-backports...) auf meiner Sun Ultra 45 zu kompilieren....
  4. Neuer Kernel-Zweig nur für Sicherheitskorrekturen

    Neuer Kernel-Zweig nur für Sicherheitskorrekturen: Sasha Levin von Oracle hat angekündigt, von den stabilen Kernel-Versionen eigene Versionen pflegen zu wollen, die bis auf Sicherheitskorrekturen...
  5. Linux-Kernel 4.6 tritt in die Testphase ein

    Linux-Kernel 4.6 tritt in die Testphase ein: Linux-Initiator Linus Torvalds hat die Kernel-Version 4.6-rc1 als erste Testversion für Linux 4.6 freigegeben. Die Verbesserungen ziehen sich...