Wo finde ich Gnome Libs " gnomeConf.sh "

Dieses Thema im Forum "SuSE / OpenSuSE" wurde erstellt von pacific, 04.02.2006.

  1. #1 pacific, 04.02.2006
    pacific

    pacific Jungspund

    Dabei seit:
    04.02.2006
    Beiträge:
    11
    Zustimmungen:
    0
    Hi,

    habe schon alles mögliche installiert:

    gnome-libs-1.4.1.2.90-46.src.rpm
    gnome-libs-1.4.1.7-682.src.rpm
    libtasn1-devel-0.2.9-1suse91.i686.rpm usw.

    Leider bin ich nicht weiter gekommen. Hier die Meldung:

    checking whether to enable maintainer-specific portions of Makefiles... no
    checking for gnome-config... no
    checking for gnomeConf.sh file in /usr/local/lib... not found
    configure: error: Could not find the gnomeConf.sh file that is generated by gnome-libs install

    Danke für jede HILFFFFEEEEEE
     
  2. Anzeige

    Schau dir mal diese Kategorie an. Dort findest du bestimmt etwas.
    Registrieren bzw. einloggen, um diese und auch andere Anzeigen zu deaktivieren
  3. #2 tuxlover, 04.02.2006
    tuxlover

    tuxlover Der den Tux knuddelt

    Dabei seit:
    26.10.2005
    Beiträge:
    2.106
    Zustimmungen:
    0
    Ort:
    berlin
    was willst du denn machen? was versuchst du zu compilieren?
     
  4. #3 pacific, 04.02.2006
    pacific

    pacific Jungspund

    Dabei seit:
    04.02.2006
    Beiträge:
    11
    Zustimmungen:
    0
    Danke

    Ich will die Software gstalker installieren. Ich hatte gerade festgestellt, dass ich zwei verschiedene Lib angelegt hatte. Einmal unter /usr/lib und /usr/local/lib

    Jetzt hatte ich die /usr/local/lib in die /usr/lib kopiert und einen link auf /usr/local

    Soweit hat es funktioniert, nur jetzt kommen folgende Meldungen:

    /usr/include/libgnomeui/gnome-lamp.h:24:26: error: gdk/gdktypes.h: No such file or directory
    In file included from /usr/include/libgnomeui/libgnomeui.h:44,
    from /usr/include/gnome.h:11,
    from gstalker.h:24,
    from main.c:22:
    /usr/include/libgnomeui/gnome-lamp.h:42: error: field ‘gpixmap’ has incomplete type
    /usr/include/libgnomeui/gnome-lamp.h:45: error: syntax error before ‘GdkColor’
    /usr/include/libgnomeui/gnome-lamp.h:47: error: syntax error before ‘index’
    /usr/include/libgnomeui/gnome-lamp.h:51: error: field ‘parent_class’ has incomplete type
    /usr/include/libgnomeui/gnome-lamp.h:88: error: syntax error before ‘gnome_lamp_get_type’
    /usr/include/libgnomeui/gnome-lamp.h:89: error: syntax error before ‘*’ token
    /usr/include/libgnomeui/gnome-lamp.h:90: error: syntax error before ‘*’ token
    /usr/include/libgnomeui/gnome-lamp.h:90: error: syntax error before ‘*’ token
    /usr/include/libgnomeui/gnome-lamp.h:91: error: syntax error before ‘*’ token
    /usr/include/libgnomeui/gnome-lamp.h:93: error: syntax error before ‘*’ token
    In file included from /usr/include/libgnomeui/libgnomeui.h:45,
    from /usr/include/gnome.h:11,
    from gstalker.h:24,
    from main.c:22:
    /usr/include/libgnomeui/gtkdial.h:23:31: error: gtk/gtkadjustment.h: No such file or directory
    In file included from /usr/include/libgnomeui/libgnomeui.h:45,
    from /usr/include/gnome.h:11,
    from gstalker.h:24,
    from main.c:22:
    /usr/include/libgnomeui/gtkdial.h:42: error: syntax error before ‘GtkWidget’
    /usr/include/libgnomeui/gtkdial.h:44: error: syntax error before ‘*’ token
    /usr/include/libgnomeui/gtkdial.h:46: error: syntax error before ‘policy’
    /usr/include/libgnomeui/gtkdial.h:47: error: conflicting types for ‘button’
    /usr/include/libgnomeui/gnome-color-selector.h:25: error: previous declaration of ‘button’ was here
    /usr/include/libgnomeui/gtkdial.h:50: error: syntax error before ‘radius’
    /usr/include/libgnomeui/gtkdial.h:51: error: syntax error before ‘pointer_width’
    /usr/include/libgnomeui/gtkdial.h:53: error: syntax error before ‘timer’
    /usr/include/libgnomeui/gtkdial.h:55: error: syntax error before ‘angle’
    /usr/include/libgnomeui/gtkdial.h:56: error: syntax error before ‘percentage’
    /usr/include/libgnomeui/gtkdial.h:57: error: syntax error before ‘old_value’
    /usr/include/libgnomeui/gtkdial.h:58: error: syntax error before ‘old_lower’
    /usr/include/libgnomeui/gtkdial.h:59: error: syntax error before ‘old_upper’
    /usr/include/libgnomeui/gtkdial.h:65: error: syntax error before ‘GtkWidgetClass’
    /usr/include/libgnomeui/gtkdial.h:69: error: syntax error before ‘*’ token
    /usr/include/libgnomeui/gtkdial.h:69: error: syntax error before ‘*’ token
    /usr/include/libgnomeui/gtkdial.h:70: error: syntax error before ‘gtk_dial_get_type’
    /usr/include/libgnomeui/gtkdial.h:71: error: syntax error before ‘*’ token
    /usr/include/libgnomeui/gtkdial.h:73: error: syntax error before ‘GtkUpdateType’
    /usr/include/libgnomeui/gtkdial.h:76: error: syntax error before ‘GtkAdjustment’
    /usr/include/libgnomeui/gtkdial.h:77: error: syntax error before ‘gtk_dial_set_percentage’
    /usr/include/libgnomeui/gtkdial.h:78: error: syntax error before ‘gfloat’
    /usr/include/libgnomeui/gtkdial.h:79: error: syntax error before ‘gtk_dial_get_percentage’
    /usr/include/libgnomeui/gtkdial.h:80: error: syntax error before ‘gtk_dial_set_value’
    /usr/include/libgnomeui/gtkdial.h:81: error: syntax error before ‘gfloat’
    /usr/include/libgnomeui/gtkdial.h:82: error: syntax error before ‘gtk_dial_get_value’
    In file included from gstalker.h:28,
    from main.c:22:
    /usr/include/string.h:304: error: ‘index’ redeclared as different kind of symbol
    /usr/include/libgnomeui/gnome-lamp.h:47: error: previous declaration of ‘index’ was here
    In file included from gstalker.h:38,
    from main.c:22:
    ./config.h:25: error: syntax error before ‘init’
    ./config.h:25: warning: type defaults to ‘int’ in declaration of ‘init’
    ./config.h:25: warning: data definition has no type or storage class
    In file included from main.c:22:
    gstalker.h:39:20: error: stocks.h: No such file or directory
    In file included from main.c:22:
    gstalker.h:45: error: syntax error before ‘gdouble’
    gstalker.h:45: warning: no semicolon at end of struct or union
    gstalker.h:46: warning: type defaults to ‘int’ in declaration of ‘min’
    gstalker.h:46: warning: data definition has no type or storage class
    gstalker.h:47: error: syntax error before ‘max’
    gstalker.h:47: warning: type defaults to ‘int’ in declaration of ‘max’
    gstalker.h:47: warning: data definition has no type or storage class
    gstalker.h:48: error: syntax error before ‘zero’
    gstalker.h:48: warning: type defaults to ‘int’ in declaration of ‘zero’
    gstalker.h:48: warning: data definition has no type or storage class
    gstalker.h:49: error: syntax error before ‘height’
    gstalker.h:49: warning: type defaults to ‘int’ in declaration of ‘height’
    gstalker.h:49: warning: data definition has no type or storage class
    gstalker.h:56: error: syntax error before ‘gint’
    gstalker.h:56: warning: no semicolon at end of struct or union
    gstalker.h:57: warning: type defaults to ‘int’ in declaration of ‘ma_type’
    gstalker.h:57: warning: data definition has no type or storage class
    gstalker.h:58: error: syntax error before ‘field’
    gstalker.h:58: warning: type defaults to ‘int’ in declaration of ‘field’
    gstalker.h:58: warning: data definition has no type or storage class
    gstalker.h:59: error: syntax error before ‘period’
    gstalker.h:59: warning: type defaults to ‘int’ in declaration of ‘period’
    gstalker.h:59: warning: data definition has no type or storage class
    gstalker.h:60: error: syntax error before ‘period2’
    gstalker.h:60: warning: type defaults to ‘int’ in declaration of ‘period2’
    gstalker.h:60: warning: data definition has no type or storage class
    gstalker.h:61: error: syntax error before ‘red’
    gstalker.h:61: warning: type defaults to ‘int’ in declaration of ‘red’
    gstalker.h:61: warning: data definition has no type or storage class
    gstalker.h:62: error: syntax error before ‘green’
    gstalker.h:62: warning: type defaults to ‘int’ in declaration of ‘green’
    gstalker.h:62: warning: data definition has no type or storage class
    gstalker.h:63: error: syntax error before ‘blue’
    gstalker.h:63: warning: type defaults to ‘int’ in declaration of ‘blue’
    gstalker.h:63: warning: data definition has no type or storage class
    gstalker.h:64: error: syntax error before ‘red2’
    gstalker.h:64: warning: type defaults to ‘int’ in declaration of ‘red2’
    gstalker.h:64: warning: data definition has no type or storage class
    gstalker.h:65: error: syntax error before ‘green2’
    gstalker.h:65: warning: type defaults to ‘int’ in declaration of ‘green2’
    gstalker.h:65: warning: data definition has no type or storage class
    gstalker.h:66: error: syntax error before ‘blue2’
    gstalker.h:66: warning: type defaults to ‘int’ in declaration of ‘blue2’
    gstalker.h:66: warning: data definition has no type or storage class
    gstalker.h:67: error: syntax error before ‘ob’
    gstalker.h:67: warning: type defaults to ‘int’ in declaration of ‘ob’
    gstalker.h:67: warning: data definition has no type or storage class
    gstalker.h:68: error: syntax error before ‘os’
    gstalker.h:68: warning: type defaults to ‘int’ in declaration of ‘os’
    gstalker.h:68: warning: data definition has no type or storage class
    gstalker.h:69: error: syntax error before ‘envelope’
    gstalker.h:69: warning: type defaults to ‘int’ in declaration of ‘envelope’
    gstalker.h:69: warning: data definition has no type or storage class
    gstalker.h:70: error: syntax error before ‘slow’
    gstalker.h:70: warning: type defaults to ‘int’ in declaration of ‘slow’
    gstalker.h:70: warning: data definition has no type or storage class
    gstalker.h:71: error: syntax error before ‘fast’
    gstalker.h:71: warning: type defaults to ‘int’ in declaration of ‘fast’
    gstalker.h:71: warning: data definition has no type or storage class
    gstalker.h:72: error: syntax error before ‘signal’
    gstalker.h:72: warning: type defaults to ‘int’ in declaration of ‘signal’
    gstalker.h:72: warning: data definition has no type or storage class
    gstalker.h:73: error: syntax error before ‘deviations’
    gstalker.h:73: warning: type defaults to ‘int’ in declaration of ‘deviations’
    gstalker.h:73: warning: data definition has no type or storage class
    In file included from gstalker.h:79,
    from main.c:22:
    accumdist.h:23: error: syntax error before ‘*’ token
    accumdist.h:23: error: syntax error before ‘*’ token
    accumdist.h:24: warning: type defaults to ‘int’ in declaration of ‘calculate_accumdist’
    accumdist.h:24: warning: data definition has no type or storage class
    accumdist.h:29: error: syntax error before ‘*’ token
    accumdist.h:29: error: syntax error before ‘*’ token
    accumdist.h:29: warning: type defaults to ‘int’ in declaration of ‘calculate_williams_accumdist’
    accumdist.h:29: warning: data definition has no type or storage class
    In file included from gstalker.h:80,
    from main.c:22:
    bollinger.h:24: error: syntax error before ‘*’ token
    bollinger.h:24: error: syntax error before ‘*’ token
    bollinger.h:24: warning: type defaults to ‘int’ in declaration of ‘calculate_SD’
    bollinger.h:24: warning: data definition has no type or storage class
    In file included from gstalker.h:81,
    from main.c:22:
    callbacks.h:20: error: syntax error before ‘*’ token
    callbacks.h:20: warning: type defaults to ‘int’ in declaration of ‘create_compression_list’
    callbacks.h:20: warning: data definition has no type or storage class
    callbacks.h:21: error: syntax error before ‘*’ token
    callbacks.h:21: warning: type defaults to ‘int’ in declaration of ‘create_futures_month’
    callbacks.h:21: warning: data definition has no type or storage class
    callbacks.h:22: error: syntax error before ‘*’ token
    callbacks.h:22: warning: type defaults to ‘int’ in declaration of ‘create_futures_symbols’
    callbacks.h:22: warning: data definition has no type or storage class
    callbacks.h:23: error: syntax error before ‘*’ token
    callbacks.h:23: warning: type defaults to ‘int’ in declaration of ‘create_ma_list’
    callbacks.h:23: warning: data definition has no type or storage class
    callbacks.h:24: error: syntax error before ‘*’ token
    callbacks.h:24: warning: type defaults to ‘int’ in declaration of ‘create_indicator_list’
    callbacks.h:24: warning: data definition has no type or storage class
    callbacks.h:25: error: syntax error before ‘*’ token
    callbacks.h:25: warning: type defaults to ‘int’ in declaration of ‘create_currency_list’
    callbacks.h:25: warning: data definition has no type or storage class
    callbacks.h:26: error: syntax error before ‘*’ token
    callbacks.h:26: warning: type defaults to ‘int’ in declaration of ‘create_data_field_list’
    callbacks.h:26: warning: data definition has no type or storage class
    callbacks.h:27: error: syntax error before ‘*’ token
    callbacks.h:28: error: syntax error before ‘*’ token
    callbacks.h:28: error: syntax error before ‘red’
    callbacks.h:28: warning: type defaults to ‘int’ in declaration of ‘get_color’
    callbacks.h:28: warning: data definition has no type or storage class
    callbacks.h:29: error: syntax error before ‘*’ token
    callbacks.h:32: error: syntax error before ‘*’ token
    callbacks.h:33: error: syntax error before ‘rc’
    callbacks.h:34: error: syntax error before ‘get_current_height’
    callbacks.h:34: warning: type defaults to ‘int’ in declaration of ‘get_current_height’
    callbacks.h:34: warning: data definition has no type or storage class
    callbacks.h:37: error: syntax error before ‘maxlow_interval_loop’
    callbacks.h:37: warning: type defaults to ‘int’ in declaration of ‘maxlow_interval_loop’
    callbacks.h:37: warning: parameter names (without types) in function declaration
    callbacks.h:37: warning: data definition has no type or storage class
    callbacks.h:38: error: syntax error before ‘maxhigh_interval_loop’
    callbacks.h:38: warning: type defaults to ‘int’ in declaration of ‘maxhigh_interval_loop’
    callbacks.h:38: warning: parameter names (without types) in function declaration
    callbacks.h:38: warning: data definition has no type or storage class
    callbacks.h:40: warning: parameter names (without types) in function declaration
    callbacks.h:42: warning: parameter names (without types) in function declaration
    callbacks.h:50: error: syntax error before ‘motion_notify_event’
    callbacks.h:50: error: syntax error before ‘*’ token
    callbacks.h:50: warning: type defaults to ‘int’ in declaration of ‘motion_notify_event’
    callbacks.h:50: warning: data definition has no type or storage class
    callbacks.h:51: error: syntax error before ‘button_press_event’
    callbacks.h:51: error: syntax error before ‘*’ token
    callbacks.h:51: warning: type defaults to ‘int’ in declaration of ‘button_press_event’
    callbacks.h:51: warning: data definition has no type or storage class
    callbacks.h:52: error: syntax error before ‘button_release_event’
    callbacks.h:52: error: syntax error before ‘*’ token
    callbacks.h:52: warning: type defaults to ‘int’ in declaration of ‘button_release_event’
    callbacks.h:52: warning: data definition has no type or storage class
    callbacks.h:53: error: syntax error before ‘convert_ypos_to_price_scale’
    callbacks.h:53: warning: type defaults to ‘int’ in declaration of ‘convert_ypos_to_price_scale’
    callbacks.h:53: warning: parameter names (without types) in function declaration
    callbacks.h:53: warning: data definition has no type or storage class
    callbacks.h:54: error: syntax error before ‘convert_price_to_ypos’
    callbacks.h:54: warning: type defaults to ‘int’ in declaration of ‘convert_price_to_ypos’
    callbacks.h:54: warning: parameter names (without types) in function declaration
    callbacks.h:54: warning: data definition has no type or storage class
    In file included from gstalker.h:82,
    from main.c:22:
    cci.h:23: error: syntax error before ‘*’ token
    cci.h:23: error: syntax error before ‘*’ token
    cci.h:23: warning: type defaults to ‘int’ in declaration of ‘calculate_cci’
    cci.h:23: warning: data definition has no type or storage class
    In file included from gstalker.h:83,
    from main.c:22:
    chart_objects.h:30: warning: parameter names (without types) in function declaration
    chart_objects.h:31: error: syntax error before ‘*’ token
    chart_objects.h:32: error: syntax error before ‘*’ token
    chart_objects.h:33: error: syntax error before ‘string_to_chart_object_type’
    chart_objects.h:33: error: syntax error before ‘*’ token
    chart_objects.h:33: warning: type defaults to ‘int’ in declaration of ‘string_to_chart_object_type’
    chart_objects.h:33: warning: data definition has no type or storage class
    chart_objects.h:34: error: syntax error before ‘*’ token
    chart_objects.h:38: error: syntax error before ‘*’ token
    chart_objects.h:39: error: syntax error before ‘*’ token
    chart_objects.h:40: error: syntax error before ‘*’ token
    chart_objects.h:41: error: syntax error before ‘get_new_chart_object_name’
    chart_objects.h:41: warning: type defaults to ‘int’ in declaration of ‘get_new_chart_object_name’
    chart_objects.h:41: warning: data definition has no type or storage class
    chart_objects.h:42: error: syntax error before ‘get_chart_object_list_item’
    chart_objects.h:42: warning: type defaults to ‘int’ in declaration of ‘get_chart_object_list_item’
    chart_objects.h:42: warning: parameter names (without types) in function declaration
    chart_objects.h:42: warning: data definition has no type or storage class
    chart_objects.h:43: error: syntax error before ‘*’ token
    chart_objects.h:44: error: syntax error before ‘*’ token
    chart_objects.h:48: error: syntax error before ‘*’ token
    In file included from gstalker.h:84,
    from main.c:22:
    charts.h:22: error: syntax error before ‘workwith_chart_clist_event_handler’
    charts.h:22: error: syntax error before ‘*’ token
    charts.h:22: warning: type defaults to ‘int’ in declaration of ‘workwith_chart_clist_event_handler’
    charts.h:22: warning: data definition has no type or storage class
    charts.h:24: error: syntax error before ‘*’ token
    charts.h:27: error: syntax error before ‘*’ token
    In file included from gstalker.h:85,
    from main.c:22:
    close.h:23: error: syntax error before ‘get_true_range’
    close.h:23: error: syntax error before ‘high’
    close.h:23: warning: type defaults to ‘int’ in declaration of ‘get_true_range’
    close.h:23: warning: data definition has no type or storage class
    close.h:24: error: syntax error before ‘get_median’
    close.h:24: error: syntax error before ‘high’
    close.h:24: warning: type defaults to ‘int’ in declaration of ‘get_median’
    close.h:24: warning: data definition has no type or storage class
    close.h:25: error: syntax error before ‘get_typical_price’
    close.h:25: error: syntax error before ‘high’
    close.h:25: warning: type defaults to ‘int’ in declaration of ‘get_typical_price’
    close.h:25: warning: data definition has no type or storage class
    close.h:26: error: syntax error before ‘get_weighted_close’
    close.h:26: error: syntax error before ‘high’
    close.h:26: warning: type defaults to ‘int’ in declaration of ‘get_weighted_close’
    close.h:26: warning: data definition has no type or storage class
    In file included from gstalker.h:86,
    from main.c:22:
    config.h:25: error: syntax error before ‘init’
    config.h:25: warning: type defaults to ‘int’ in declaration of ‘init’
    config.h:25: warning: data definition has no type or storage class
    In file included from gstalker.h:87,
    from main.c:22:
    currency.h:24: error: syntax error before ‘*’ token
    In file included from gstalker.h:89,
    from main.c:22:
    draw.h:21: warning: parameter names (without types) in function declaration
    draw.h:23: error: syntax error before ‘*’ token
    draw.h:24: error: syntax error before ‘*’ token
    draw.h:30: error: syntax error before ‘configure_event’
    draw.h:30: error: syntax error before ‘*’ token
    draw.h:30: warning: type defaults to ‘int’ in declaration of ‘configure_event’
    draw.h:30: warning: data definition has no type or storage class
    draw.h:31: error: syntax error before ‘expose_event’
    draw.h:31: error: syntax error before ‘*’ token
    draw.h:31: warning: type defaults to ‘int’ in declaration of ‘expose_event’
    draw.h:31: warning: data definition has no type or storage class
    draw.h:32: error: syntax error before ‘area’
    draw.h:33: error: syntax error before ‘*’ token
    draw.h:34: error: syntax error before ‘area’
    draw.h:35: error: syntax error before ‘y’
    draw.h:36: error: syntax error before ‘x’
    In file included from gstalker.h:90,
    from main.c:22:
    edit_chart_data.h:23: error: syntax error before ‘*’ token
    edit_chart_data.h:24: error: syntax error before ‘*’ token
    edit_chart_data.h:25: error: syntax error before ‘*’ token
    edit_chart_data.h:26: error: syntax error before ‘*’ token
    In file included from gstalker.h:91,
    from main.c:22:
    edit_indicators.h:23: error: syntax error before ‘*’ token
    edit_indicators.h:24: error: syntax error before ‘GString’
    edit_indicators.h:25: error: syntax error before ‘type’
    edit_indicators.h:26: error: syntax error before ‘type’
    edit_indicators.h:33: error: syntax error before ‘flag’
    edit_indicators.h:34: error: syntax error before ‘convert_data_field_string_to_enum’
    edit_indicators.h:34: error: syntax error before ‘*’ token
    edit_indicators.h:34: warning: type defaults to ‘int’ in declaration of ‘convert_data_field_string_to_enum’
    edit_indicators.h:34: warning: data definition has no type or storage class
    edit_indicators.h:35: error: syntax error before ‘*’ token
    edit_indicators.h:36: error: syntax error before ‘*’ token
    edit_indicators.h:37: error: syntax error before ‘translate_indicator_from_string’
    edit_indicators.h:37: error: syntax error before ‘*’ token
    edit_indicators.h:37: warning: type defaults to ‘int’ in declaration of ‘translate_indicator_from_string’
    edit_indicators.h:37: warning: data definition has no type or storage class
    In file included from gstalker.h:92,
    from main.c:22:
    edit_options.h:22: error: syntax error before ‘*’ token
    edit_options.h:23: error: syntax error before ‘*’ token
    In file included from gstalker.h:95,
    from main.c:22:
    file.h:23: error: syntax error before ‘GString’
    file.h:24: error: syntax error before ‘GString’
    file.h:25: error: syntax error before ‘*’ token
    file.h:26: error: syntax error before ‘create_new_chart’
    file.h:26: error: syntax error before ‘*’ token
    file.h:26: warning: type defaults to ‘int’ in declaration of ‘create_new_chart’
    file.h:26: warning: data definition has no type or storage class
    file.h:27: error: syntax error before ‘*’ token
    file.h:28: error: syntax error before ‘*’ token
    file.h:29: error: syntax error before ‘*’ token
    In file included from gstalker.h:96,
    from main.c:22:
    group.h:25: error: syntax error before ‘*’ token
    group.h:26: error: syntax error before ‘*’ token
    In file included from gstalker.h:97,
    from main.c:22:
    import.h:25: error: syntax error before ‘convert_import_field_string_to_enum’
    import.h:25: error: syntax error before ‘*’ token
    import.h:25: warning: type defaults to ‘int’ in declaration of ‘convert_import_field_string_to_enum’
    import.h:25: warning: data definition has no type or storage class
    import.h:26: error: syntax error before ‘*’ token
    import.h:36: error: syntax error before ‘import_record’
    import.h:36: error: syntax error before ‘*’ token
    import.h:36: warning: type defaults to ‘int’ in declaration of ‘import_record’
    import.h:36: warning: data definition has no type or storage class
    import.h:37: error: syntax error before ‘import_check_symbol’
    import.h:37: error: syntax error before ‘*’ token
    import.h:37: warning: type defaults to ‘int’ in declaration of ‘import_check_symbol’
    import.h:37: warning: data definition has no type or storage class
    import.h:38: error: syntax error before ‘import_check_date’
    import.h:38: error: syntax error before ‘*’ token
    import.h:38: warning: type defaults to ‘int’ in declaration of ‘import_check_date’
    import.h:38: warning: data definition has no type or storage class
    import.h:39: error: syntax error before ‘import_check_number’
    import.h:39: error: syntax error before ‘*’ token
    import.h:39: warning: type defaults to ‘int’ in declaration of ‘import_check_number’
    import.h:39: warning: data definition has no type or storage class
    In file included from gstalker.h:98,
    from main.c:22:
    ma.h:23: error: syntax error before ‘*’ token
    ma.h:23: error: syntax error before ‘*’ token
    ma.h:23: warning: type defaults to ‘int’ in declaration of ‘calculate_simple_moving_average’
    ma.h:23: warning: data definition has no type or storage class
    ma.h:24: error: syntax error before ‘*’ token
    ma.h:24: error: syntax error before ‘*’ token
    ma.h:24: warning: type defaults to ‘int’ in declaration of ‘calculate_weighted_moving_average’
    ma.h:24: warning: data definition has no type or storage class
    ma.h:25: error: syntax error before ‘*’ token
    ma.h:25: error: syntax error before ‘*’ token
    ma.h:25: warning: type defaults to ‘int’ in declaration of ‘calculate_exponential_moving_average’
    ma.h:25: warning: data definition has no type or storage class
    ma.h:35: error: syntax error before ‘*’ token
    ma.h:37: error: syntax error before ‘*’ token
    ma.h:41: warning: type defaults to ‘int’ in declaration of ‘calculate_MA’
    ma.h:41: warning: data definition has no type or storage class
    ma.h:43: error: syntax error before ‘*’ token
    ma.h:44: error: syntax error before ‘*’ token
    In file included from gstalker.h:101,
    from main.c:22:
    mom.h:28: error: syntax error before ‘*’ token
    mom.h:30: error: syntax error before ‘*’ token
    mom.h:32: warning: type defaults to ‘int’ in declaration of ‘calculate_momentum’
    mom.h:32: warning: data definition has no type or storage class
    In file included from gstalker.h:102,
    from main.c:22:
    monitor.h:28: error: syntax error before ‘update_monitor’
    monitor.h:28: warning: type defaults to ‘int’ in declaration of ‘update_monitor’
    monitor.h:28: warning: data definition has no type or storage class
    monitor.h:29: error: syntax error before ‘*’ token
    In file included from gstalker.h:105,
    from main.c:22:
    quotes.h:23: error: syntax error before ‘history_symbol_check’
    quotes.h:23: error: syntax error before ‘*’ token
    quotes.h:23: warning: type defaults to ‘int’ in declaration of ‘history_symbol_check’
    quotes.h:23: warning: data definition has no type or storage class
    quotes.h:25: error: syntax error before ‘*’ token
    quotes.h:26: error: syntax error before ‘*’ token
    quotes.h:27: error: syntax error before ‘*’ token
    quotes.h:28: error: syntax error before ‘*’ token
    quotes.h:29: error: syntax error before ‘*’ token
    quotes.h:30: error: syntax error before ‘*’ token
    quotes.h:31: error: syntax error before ‘*’ token
    In file included from gstalker.h:106,
    from main.c:22:
    roc.h:28: error: syntax error before ‘*’ token
    roc.h:30: error: syntax error before ‘*’ token
    roc.h:32: warning: type defaults to ‘int’ in declaration of ‘calculate_roc’
    roc.h:32: warning: data definition has no type or storage class
    In file included from gstalker.h:107,
    from main.c:22:
    rsi.h:23: error: syntax error before ‘*’ token
    rsi.h:25: error: syntax error before ‘*’ token
    rsi.h:27: warning: type defaults to ‘int’ in declaration of ‘calculate_rsi’
    rsi.h:27: warning: data definition has no type or storage class
    In file included from gstalker.h:108,
    from main.c:22:
    stochastic.h:23: error: syntax error before ‘*’ token
    stochastic.h:23: error: syntax error before ‘*’ token
    stochastic.h:24: warning: type defaults to ‘int’ in declaration of ‘calculate_stochastic_fastk’
    stochastic.h:24: warning: data definition has no type or storage class
    stochastic.h:25: error: syntax error before ‘*’ token
    stochastic.h:25: error: syntax error before ‘*’ token
    stochastic.h:26: warning: type defaults to ‘int’ in declaration of ‘calculate_stochastic_fastd’
    stochastic.h:26: warning: data definition has no type or storage class
    stochastic.h:27: error: syntax error before ‘*’ token
    stochastic.h:27: error: syntax error before ‘*’ token
    stochastic.h:28: warning: type defaults to ‘int’ in declaration of ‘calculate_stochastic_slowk’
    stochastic.h:28: warning: data definition has no type or storage class
    stochastic.h:29: error: syntax error before ‘*’ token
    stochastic.h:29: error: syntax error before ‘*’ token
    stochastic.h:30: warning: type defaults to ‘int’ in declaration of ‘calculate_stochastic_slowd’
    stochastic.h:30: warning: data definition has no type or storage class
    stochastic.h:31: error: syntax error before ‘*’ token
    stochastic.h:31: error: syntax error before ‘period’
    stochastic.h:31: warning: type defaults to ‘int’ in declaration of ‘calculate_stochrsi’
    stochastic.h:31: warning: data definition has no type or storage class
    stochastic.h:32: warning: parameter names (without types) in function declaration
    In file included from gstalker.h:110,
    from main.c:22:
    volatility.h:23: error: syntax error before ‘*’ token
    volatility.h:23: error: syntax error before ‘*’ token
    volatility.h:23: warning: type defaults to ‘int’ in declaration of ‘calculate_chaikin_volatility’
    volatility.h:23: warning: data definition has no type or storage class
    In file included from gstalker.h:111,
    from main.c:22:
    volume.h:25: error: syntax error before ‘*’ token
    volume.h:25: error: syntax error before ‘*’ token
    volume.h:25: warning: type defaults to ‘int’ in declaration of ‘calculate_on_balance_volume’
    volume.h:25: warning: data definition has no type or storage class
    volume.h:28: error: syntax error before ‘*’ token
    volume.h:28: error: syntax error before ‘*’ token
    volume.h:28: warning: type defaults to ‘int’ in declaration of ‘calculate_volume_roc’
    volume.h:28: warning: data definition has no type or storage class
    In file included from gstalker.h:112,
    from main.c:22:
    williamsr.h:23: error: syntax error before ‘*’ token
    williamsr.h:25: error: syntax error before ‘*’ token
    williamsr.h:29: warning: type defaults to ‘int’ in declaration of ‘calculate_williamsr’
    williamsr.h:29: warning: data definition has no type or storage class
    In file included from main.c:22:
    gstalker.h:119: error: syntax error before ‘gint’
    gstalker.h:119: warning: no semicolon at end of struct or union
    gstalker.h:120: warning: type defaults to ‘int’ in declaration of ‘co_flag’
    gstalker.h:120: warning: data definition has no type or storage class
    gstalker.h:121: error: syntax error before ‘co_x’
    gstalker.h:121: warning: type defaults to ‘int’ in declaration of ‘co_x’
    gstalker.h:121: warning: data definition has no type or storage class
    gstalker.h:122: error: syntax error before ‘co_y’
    gstalker.h:122: warning: type defaults to ‘int’ in declaration of ‘co_y’
    gstalker.h:122: warning: data definition has no type or storage class
    gstalker.h:123: error: syntax error before ‘co_x2’
    gstalker.h:123: warning: type defaults to ‘int’ in declaration of ‘co_x2’
    gstalker.h:123: warning: data definition has no type or storage class
    gstalker.h:124: error: syntax error before ‘co_y2’
    gstalker.h:124: warning: type defaults to ‘int’ in declaration of ‘co_y2’
    gstalker.h:124: warning: data definition has no type or storage class
    gstalker.h:125: error: syntax error before ‘co_r’
    gstalker.h:125: warning: type defaults to ‘int’ in declaration of ‘co_r’
    gstalker.h:125: warning: data definition has no type or storage class
    gstalker.h:126: error: syntax error before ‘co_g’
    gstalker.h:126: warning: type defaults to ‘int’ in declaration of ‘co_g’
    gstalker.h:126: warning: data definition has no type or storage class
    gstalker.h:127: error: syntax error before ‘co_b’
    gstalker.h:127: warning: type defaults to ‘int’ in declaration of ‘co_b’
    gstalker.h:127: warning: data definition has no type or storage class
    gstalker.h:128: error: syntax error before ‘co_type’
    gstalker.h:128: warning: type defaults to ‘int’ in declaration of ‘co_type’
    gstalker.h:128: warning: data definition has no type or storage class
    gstalker.h:132: error: syntax error before ‘bars’
    gstalker.h:132: warning: type defaults to ‘int’ in declaration of ‘bars’
    gstalker.h:132: warning: data definition has no type or storage class
    gstalker.h:133: error: syntax error before ‘list_view’
    gstalker.h:133: warning: type defaults to ‘int’ in declaration of ‘list_view’
    gstalker.h:133: warning: data definition has no type or storage class
    gstalker.h:134: error: syntax error before ‘grid’
    gstalker.h:134: warning: type defaults to ‘int’ in declaration of ‘grid’
    gstalker.h:134: warning: data definition has no type or storage class
    gstalker.h:135: error: syntax error before ‘currency_convert’
    gstalker.h:135: warning: type defaults to ‘int’ in declaration of ‘currency_convert’
    gstalker.h:135: warning: data definition has no type or storage class
    gstalker.h:136: error: syntax error before ‘indicator_space’
    gstalker.h:136: warning: type defaults to ‘int’ in declaration of ‘indicator_space’
    gstalker.h:136: warning: data definition has no type or storage class
    gstalker.h:137: error: syntax error before ‘monitor_flag’
    gstalker.h:137: warning: type defaults to ‘int’ in declaration of ‘monitor_flag’
    gstalker.h:137: warning: data definition has no type or storage class
    gstalker.h:138: error: syntax error before ‘high’
    gstalker.h:138: warning: type defaults to ‘int’ in declaration of ‘high’
    gstalker.h:138: warning: data definition has no type or storage class
    gstalker.h:139: error: syntax error before ‘low’
    gstalker.h:139: warning: type defaults to ‘int’ in declaration of ‘low’
    gstalker.h:139: warning: data definition has no type or storage class
    gstalker.h:140: error: syntax error before ‘range’
    gstalker.h:140: warning: type defaults to ‘int’ in declaration of ‘range’
    gstalker.h:140: warning: data definition has no type or storage class
    gstalker.h:141: error: syntax error before ‘pixelspace’
    gstalker.h:141: warning: type defaults to ‘int’ in declaration of ‘pixelspace’
    gstalker.h:141: warning: data definition has no type or storage class
    gstalker.h:142: error: syntax error before ‘status’
    gstalker.h:142: warning: type defaults to ‘int’ in declaration of ‘status’
    gstalker.h:142: warning: data definition has no type or storage class
    gstalker.h:143: error: syntax error before ‘interval’
    gstalker.h:143: warning: type defaults to ‘int’ in declaration of ‘interval’
    gstalker.h:143: warning: data definition has no type or storage class
    gstalker.h:144: error: syntax error before ‘group_id’
    gstalker.h:144: warning: type defaults to ‘int’ in declaration of ‘group_id’
    gstalker.h:144: warning: data definition has no type or storage class
    gstalker.h:145: error: syntax error before ‘monitor_id’
    gstalker.h:145: warning: type defaults to ‘int’ in declaration of ‘monitor_id’
    gstalker.h:145: warning: data definition has no type or storage class
    gstalker.h:146: error: syntax error before ‘monitor_pid’
    gstalker.h:146: warning: type defaults to ‘int’ in declaration of ‘monitor_pid’
    gstalker.h:146: warning: data definition has no type or storage class
    gstalker.h:147: error: syntax error before ‘oldy’
    gstalker.h:147: warning: type defaults to ‘int’ in declaration of ‘oldy’
    gstalker.h:147: warning: data definition has no type or storage class
    gstalker.h:148: error: syntax error before ‘oldx’
    gstalker.h:148: warning: type defaults to ‘int’ in declaration of ‘oldx’
    gstalker.h:148: warning: data definition has no type or storage class
    gstalker.h:149: error: syntax error before ‘monitor_update’
    gstalker.h:149: warning: type defaults to ‘int’ in declaration of ‘monitor_update’
    gstalker.h:149: warning: data definition has no type or storage class
    gstalker.h:150: error: syntax error before ‘proxy_flag’
    gstalker.h:150: warning: type defaults to ‘int’ in declaration of ‘proxy_flag’
    gstalker.h:150: warning: data definition has no type or storage class
    gstalker.h:151: error: syntax error before ‘proxy_port’
    gstalker.h:151: warning: type defaults to ‘int’ in declaration of ‘proxy_port’
    gstalker.h:151: warning: data definition has no type or storage class
    gstalker.h:152: error: syntax error before ‘indicator_size’
    gstalker.h:152: warning: type defaults to ‘int’ in declaration of ‘indicator_size’
    gstalker.h:152: warning: data definition has no type or storage class
    gstalker.h:155: error: syntax error before ‘background_red’
    gstalker.h:155: warning: type defaults to ‘int’ in declaration of ‘background_red’
    gstalker.h:155: warning: data definition has no type or storage class
    gstalker.h:156: error: syntax error before ‘background_green’
    gstalker.h:156: warning: type defaults to ‘int’ in declaration of ‘background_green’
    gstalker.h:156: warning: data definition has no type or storage class
    gstalker.h:157: error: syntax error before ‘background_blue’
    gstalker.h:157: warning: type defaults to ‘int’ in declaration of ‘background_blue’
    gstalker.h:157: warning: data definition has no type or storage class
    gstalker.h:159: error: syntax error before ‘border_red’
    gstalker.h:159: warning: type defaults to ‘int’ in declaration of ‘border_red’
    gstalker.h:159: warning: data definition has no type or storage class
    gstalker.h:160: error: syntax error before ‘border_green’
    gstalker.h:160: warning: type defaults to ‘int’ in declaration of ‘border_green’
    gstalker.h:160: warning: data definition has no type or storage class
    gstalker.h:161: error: syntax error before ‘border_blue’
    gstalker.h:161: warning: type defaults to ‘int’ in declaration of ‘border_blue’
    gstalker.h:161: warning: data definition has no type or storage class
    gstalker.h:163: error: syntax error before ‘grid_red’
    gstalker.h:163: warning: type defaults to ‘int’ in declaration of ‘grid_red’
    gstalker.h:163: warning: data definition has no type or storage class
    gstalker.h:164: error: syntax error before ‘grid_green’
    gstalker.h:164: warning: type defaults to ‘int’ in declaration of ‘grid_green’
    gstalker.h:164: warning: data definition has no type or storage class
    gstalker.h:165: error: syntax error before ‘grid_blue’
    gstalker.h:165: warning: type defaults to ‘int’ in declaration of ‘grid_blue’
    gstalker.h:165: warning: data definition has no type or storage class
    gstalker.h:167: error: syntax error before ‘crosshair_red’
    gstalker.h:167: warning: type defaults to ‘int’ in declaration of ‘crosshair_red’
    gstalker.h:167: warning: data definition has no type or storage class
    gstalker.h:168: error: syntax error before ‘crosshair_green’
    gstalker.h:168: warning: type defaults to ‘int’ in declaration of ‘crosshair_green’
    gstalker.h:168: warning: data definition has no type or storage class
    gstalker.h:169: error: syntax error before ‘crosshair_blue’
    gstalker.h:169: warning: type defaults to ‘int’ in declaration of ‘crosshair_blue’
    gstalker.h:169: warning: data definition has no type or storage class
    gstalker.h:171: error: syntax error before ‘zone_red’
    gstalker.h:171: warning: type defaults to ‘int’ in declaration of ‘zone_red’
    gstalker.h:171: warning: data definition has no type or storage class
    gstalker.h:172: error: syntax error before ‘zone_green’
    gstalker.h:172: warning: type defaults to ‘int’ in declaration of ‘zone_green’
    gstalker.h:172: warning: data definition has no type or storage class
    gstalker.h:173: error: syntax error before ‘zone_blue’
    gstalker.h:173: warning: type defaults to ‘int’ in declaration of ‘zone_blue’
    gstalker.h:173: warning: data definition has no type or storage class
    gstalker.h:181: error: syntax error before ‘*’ token
    gstalker.h:181: warning: type defaults to ‘int’ in declaration of ‘date_array’
    gstalker.h:181: warning: data definition has no type or storage class
    gstalker.h:182: error: syntax error before ‘*’ token
    gstalker.h:182: warning: type defaults to ‘int’ in declaration of ‘open_array’
    gstalker.h:182: warning: data definition has no type or storage class
    gstalker.h:183: error: syntax error before ‘*’ token
    gstalker.h:183: warning: type defaults to ‘int’ in declaration of ‘high_array’
    gstalker.h:183: warning: data definition has no type or storage class
    gstalker.h:184: error: syntax error before ‘*’ token
    gstalker.h:184: warning: type defaults to ‘int’ in declaration of ‘low_array’
    gstalker.h:184: warning: data definition has no type or storage class
    gstalker.h:185: error: syntax error before ‘*’ token
    gstalker.h:185: warning: type defaults to ‘int’ in declaration of ‘close_array’
    gstalker.h:185: warning: data definition has no type or storage class
    gstalker.h:186: error: syntax error before ‘*’ token
    gstalker.h:186: warning: type defaults to ‘int’ in declaration of ‘volume_array’
    gstalker.h:186: warning: data definition has no type or storage class
    gstalker.h:187: error: syntax error before ‘*’ token
    gstalker.h:187: warning: type defaults to ‘int’ in declaration of ‘openint_array’
    gstalker.h:187: warning: data definition has no type or storage class
    gstalker.h:190: error: syntax error before ‘*’ token
    gstalker.h:190: warning: type defaults to ‘int’ in declaration of ‘scratch’
    gstalker.h:190: warning: data definition has no type or storage class
    gstalker.h:191: error: syntax error before ‘*’ token
    gstalker.h:191: warning: type defaults to ‘int’ in declaration of ‘home’
    gstalker.h:191: warning: data definition has no type or storage class
    gstalker.h:192: error: syntax error before ‘*’ token
    gstalker.h:192: warning: type defaults to ‘int’ in declaration of ‘datapath’
    gstalker.h:192: warning: data definition has no type or storage class
    gstalker.h:193: error: syntax error before ‘*’ token
    gstalker.h:193: warning: type defaults to ‘int’ in declaration of ‘currency_symbol’
    gstalker.h:193: warning: data definition has no type or storage class
    gstalker.h:194: error: syntax error before ‘*’ token
    gstalker.h:194: warning: type defaults to ‘int’ in declaration of ‘current_group’
    gstalker.h:194: warning: data definition has no type or storage class
    gstalker.h:195: error: syntax error before ‘*’ token
    gstalker.h:195: warning: type defaults to ‘int’ in declaration of ‘lastdir’
    gstalker.h:195: warning: data definition has no type or storage class
    gstalker.h:196: error: syntax error before ‘*’ token
    gstalker.h:196: warning: type defaults to ‘int’ in declaration of ‘indicator_data’
    gstalker.h:196: warning: data definition has no type or storage class
    gstalker.h:197: error: syntax error before ‘*’ token
    gstalker.h:197: warning: type defaults to ‘int’ in declaration of ‘monitor’
    gstalker.h:197: warning: data definition has no type or storage class
    gstalker.h:198: error: syntax error before ‘*’ token
    gstalker.h:198: warning: type defaults to ‘int’ in declaration of ‘proxy’
    gstalker.h:198: warning: data definition has no type or storage class
    gstalker.h:201: error: syntax error before ‘*’ token
    gstalker.h:201: warning: type defaults to ‘int’ in declaration of ‘main_window’
    gstalker.h:201: warning: data definition has no type or storage class
    gstalker.h:202: error: syntax error before ‘*’ token
    gstalker.h:202: warning: type defaults to ‘int’ in declaration of ‘chart_pixmap’
    gstalker.h:202: warning: data definition has no type or storage class
    gstalker.h:203: error: syntax error before ‘*’ token
    gstalker.h:203: warning: type defaults to ‘int’ in declaration of ‘chart’
    gstalker.h:203: warning: data definition has no type or storage class
    gstalker.h:204: error: syntax error before ‘*’ token
    gstalker.h:205: warning: type defaults to ‘int’ in declaration of ‘scale_pixmap’
    gstalker.h:205: warning: data definition has no type or storage class
    gstalker.h:206: error: syntax error before ‘*’ token
    gstalker.h:206: warning: type defaults to ‘int’ in declaration of ‘data_bar’
    gstalker.h:206: warning: data definition has no type or storage class
    gstalker.h:207: error: syntax error before ‘*’ token
    gstalker.h:207: warning: type defaults to ‘int’ in declaration of ‘fs’
    gstalker.h:207: warning: data definition has no type or storage class
    gstalker.h:208: error: syntax error before ‘*’ token
    gstalker.h:208: warning: type defaults to ‘int’ in declaration of ‘stats_bar’
    gstalker.h:208: warning: data definition has no type or storage class
    gstalker.h:211: error: syntax error before ‘*’ token
    gstalker.h:211: warning: type defaults to ‘int’ in declaration of ‘data_window’
    gstalker.h:211: warning: data definition has no type or storage class
    gstalker.h:212: error: syntax error before ‘*’ token
    gstalker.h:212: warning: type defaults to ‘int’ in declaration of ‘data_window_swindow’
    gstalker.h:212: warning: data definition has no type or storage class
    gstalker.h:213: error: syntax error before ‘*’ token
    gstalker.h:213: warning: type defaults to ‘int’ in declaration of ‘data_window_clist’
    gstalker.h:213: warning: data definition has no type or storage class
    gstalker.h:214: error: syntax error before ‘*’ token
    gstalker.h:214: warning: type defaults to ‘int’ in declaration of ‘data_window_cap’
    gstalker.h:214: warning: data definition has no type or storage class
    gstalker.h:215: error: syntax error before ‘*’ token
    gstalker.h:215: warning: type defaults to ‘int’ in declaration of ‘data_window_earnings’
    gstalker.h:215: warning: data definition has no type or storage class
    gstalker.h:216: error: syntax error before ‘*’ token
    gstalker.h:216: warning: type defaults to ‘int’ in declaration of ‘data_window_pe’
    gstalker.h:216: warning: data definition has no type or storage class
    gstalker.h:217: error: syntax error before ‘*’ token
    gstalker.h:217: warning: type defaults to ‘int’ in declaration of ‘data_window_range’
    gstalker.h:217: warning: data definition has no type or storage class
    gstalker.h:220: error: syntax error before ‘*’ token
    gstalker.h:220: warning: type defaults to ‘int’ in declaration of ‘edit_group_clist’
    gstalker.h:220: warning: data definition has no type or storage class
    gstalker.h:223: error: syntax error before ‘*’ token
    gstalker.h:223: warning: type defaults to ‘int’ in declaration of ‘active_indicator_window’
    gstalker.h:223: warning: data definition has no type or storage class
    gstalker.h:224: error: syntax error before ‘*’ token
    gstalker.h:224: warning: type defaults to ‘int’ in declaration of ‘active_indicator_clist’
    gstalker.h:224: warning: data definition has no type or storage class
    gstalker.h:225: error: syntax error before ‘*’ token
    gstalker.h:225: warning: type defaults to ‘int’ in declaration of ‘active_indicator_delete_button’
    gstalker.h:225: warning: data definition has no type or storage class
    gstalker.h:226: error: syntax error before ‘*’ token
    gstalker.h:226: warning: type defaults to ‘int’ in declaration of ‘active_indicator_edit_button’
    gstalker.h:226: warning: data definition has no type or storage class
    gstalker.h:229: error: syntax error before ‘*’ token
    gstalker.h:229: warning: type defaults to ‘int’ in declaration of ‘workwith_charts_window’
    gstalker.h:229: warning: data definition has no type or storage class
    gstalker.h:230: error: syntax error before ‘*’ token
    gstalker.h:230: warning: type defaults to ‘int’ in declaration of ‘workwith_charts_clist’
    gstalker.h:230: warning: data definition has no type or storage class
    gstalker.h:231: error: syntax error before ‘*’ token
    gstalker.h:231: warning: type defaults to ‘int’ in declaration of ‘workwith_new_button’
    gstalker.h:231: warning: data definition has no type or storage class
    gstalker.h:232: error: syntax error before ‘*’ token
    gstalker.h:232: warning: type defaults to ‘int’ in declaration of ‘workwith_open_button’
    gstalker.h:232: warning: data definition has no type or storage class
    gstalker.h:233: error: syntax error before ‘*’ token
    gstalker.h:233: warning: type defaults to ‘int’ in declaration of ‘workwith_delete_button’
    gstalker.h:233: warning: data definition has no type or storage class
    gstalker.h:234: error: syntax error before ‘*’ token
    gstalker.h:234: warning: type defaults to ‘int’ in declaration of ‘workwith_edit_button’
    gstalker.h:234: warning: data definition has no type or storage class
    gstalker.h:237: error: syntax error before ‘*’ token
    gstalker.h:237: warning: type defaults to ‘int’ in declaration of ‘edit_chart_dialog’
    gstalker.h:237: warning: data definition has no type or storage class
    gstalker.h:240: error: syntax error before ‘*’ token
    gstalker.h:240: warning: type defaults to ‘int’ in declaration of ‘edit_options_dialog’
    gstalker.h:240: warning: data definition has no type or storage class
    gstalker.h:241: error: syntax error before ‘*’ token
    gstalker.h:241: warning: type defaults to ‘int’ in declaration of ‘edit_options_proxy_entry’
    gstalker.h:241: warning: data definition has no type or storage class
    gstalker.h:244: error: syntax error before ‘*’ token
    gstalker.h:244: warning: type defaults to ‘int’ in declaration of ‘import_dialog’
    gstalker.h:244: warning: data definition has no type or storage class
    gstalker.h:245: error: syntax error before ‘*’ token
    gstalker.h:245: warning: type defaults to ‘int’ in declaration of ‘import_file_label’
    gstalker.h:245: warning: data definition has no type or storage class
    gstalker.h:246: error: syntax error before ‘*’ token
    gstalker.h:246: warning: type defaults to ‘int’ in declaration of ‘import_rules_clist’
    gstalker.h:246: warning: data definition has no type or storage class
    gstalker.h:247: error: syntax error before ‘*’ token
    gstalker.h:247: warning: type defaults to ‘int’ in declaration of ‘import_currency_combo’
    gstalker.h:247: warning: data definition has no type or storage class
    gstalker.h:248: error: syntax error before ‘*’ token
    gstalker.h:248: warning: type defaults to ‘int’ in declaration of ‘import_ok_button’
    gstalker.h:248: warning: data definition has no type or storage class
    gstalker.h:249: error: syntax error before ‘*’ token
    gstalker.h:249: warning: type defaults to ‘int’ in declaration of ‘import_edit_button’
    gstalker.h:249: warning: data definition has no type or storage class
    gstalker.h:250: error: syntax error before ‘*’ token
    gstalker.h:250: warning: type defaults to ‘int’ in declaration of ‘import_delete_button’
    gstalker.h:250: error: ‘import_delete_button’ redeclared as different kind of symbol
    import.h:41: error: previous declaration of ‘import_delete_button’ was here
    gstalker.h:250: warning: data definition has no type or storage class
    gstalker.h:251: error: syntax error before ‘*’ token
    gstalker.h:251: warning: type defaults to ‘int’ in declaration of ‘import_symbol_entry’
    gstalker.h:251: warning: data definition has no type or storage class
    gstalker.h:254: error: syntax error before ‘*’ token
    gstalker.h:254: warning: type defaults to ‘int’ in declaration of ‘quotes_clist’
    gstalker.h:254: warning: data definition has no type or storage class
    gstalker.h:255: error: syntax error before ‘*’ token
    gstalker.h:255: warning: type defaults to ‘int’ in declaration of ‘quote_entry’
    gstalker.h:255: warning: data definition has no type or storage class
    gstalker.h:256: error: syntax error before ‘*’ token
    gstalker.h:256: warning: type defaults to ‘int’ in declaration of ‘quote_delete_button’
    gstalker.h:256: warning: data definition has no type or storage class
    gstalker.h:257: error: syntax error before ‘*’ token
    gstalker.h:257: warning: type defaults to ‘int’ in declaration of ‘quote_download_button’
    gstalker.h:257: warning: data definition has no type or storage class
    gstalker.h:258: error: syntax error before ‘*’ token
    gstalker.h:258: warning: type defaults to ‘int’ in declaration of ‘quote_add_button’
    gstalker.h:258: warning: data definition has no type or storage class
    gstalker.h:259: error: syntax error before ‘*’ token
    gstalker.h:259: warning: type defaults to ‘int’ in declaration of ‘quote_date_selector’
    gstalker.h:259: warning: data definition has no type or storage class
    gstalker.h:260: error: syntax error before ‘*’ token
    gstalker.h:260: warning: type defaults to ‘int’ in declaration of ‘quote_date_selector2’
    gstalker.h:260: warning: data definition has no type or storage class
    gstalker.h:263: error: syntax error before ‘*’ token
    gstalker.h:263: warning: type defaults to ‘int’ in declaration of ‘import_edit_rule_dialog’
    gstalker.h:263: warning: data definition has no type or storage class
    gstalker.h:264: error: syntax error before ‘*’ token
    gstalker.h:264: warning: type defaults to ‘int’ in declaration of ‘import_rule_name’
    gstalker.h:264: warning: data definition has no type or storage class
    gstalker.h:265: error: syntax error before ‘*’ token
    gstalker.h:265: warning: type defaults to ‘int’ in declaration of ‘import_rule’
    gstalker.h:265: warning: data definition has no type or storage class
    gstalker.h:266: error: syntax error before ‘*’ token
    gstalker.h:266: warning: type defaults to ‘int’ in declaration of ‘import_edit_rule_clist’
    gstalker.h:266: warning: data definition has no type or storage class
    gstalker.h:267: error: syntax error before ‘*’ token
    gstalker.h:267: warning: type defaults to ‘int’ in declaration of ‘import_rule_field_clist’
    gstalker.h:267: warning: data definition has no type or storage class
    gstalker.h:268: error: syntax error before ‘*’ token
    gstalker.h:268: warning: type defaults to ‘int’ in declaration of ‘import_edit_rule_insert_button’
    gstalker.h:268: warning: data definition has no type or storage class
    gstalker.h:269: error: syntax error before ‘*’ token
    gstalker.h:269: warning: type defaults to ‘int’ in declaration of ‘import_edit_rule_delete_button’
    gstalker.h:269: warning: data definition has no type or storage class
    gstalker.h:272: error: syntax error before ‘*’ token
    gstalker.h:272: warning: type defaults to ‘int’ in declaration of ‘monitor_window’
    gstalker.h:272: warning: data definition has no type or storage class
    gstalker.h:273: error: syntax error before ‘*’ token
    gstalker.h:273: warning: type defaults to ‘int’ in declaration of ‘clock_counter’
    gstalker.h:273: warning: data definition has no type or storage class
    gstalker.h:274: error: syntax error before ‘*’ token
    gstalker.h:274: warning: type defaults to ‘int’ in declaration of ‘monitor_clist’
    gstalker.h:274: warning: data definition has no type or storage class
    gstalker.h:275: error: syntax error before ‘*’ token
    gstalker.h:275: warning: type defaults to ‘int’ in declaration of ‘monitor_button’
    gstalker.h:275: warning: data definition has no type or storage class
    gstalker.h:276: error: syntax error before ‘*’ token
    gstalker.h:276: warning: type defaults to ‘int’ in declaration of ‘monitor_edit_button’
    gstalker.h:276: warning: data definition has no type or storage class
    gstalker.h:277: error: syntax error before ‘*’ token
    gstalker.h:277: warning: type defaults to ‘int’ in declaration of ‘monitor_delete_button’
    gstalker.h:277: warning: data definition has no type or storage class
    gstalker.h:280: error: syntax error before ‘*’ token
    gstalker.h:280: warning: type defaults to ‘int’ in declaration of ‘portfolio_window’
    gstalker.h:280: warning: data definition has no type or storage class
    gstalker.h:281: error: syntax error before ‘*’ token
    gstalker.h:281: warning: type defaults to ‘int’ in declaration of ‘portfolio_clist’
    gstalker.h:281: warning: data definition has no type or storage class
    gstalker.h:282: error: syntax error before ‘*’ token
    gstalker.h:282: warning: type defaults to ‘int’ in declaration of ‘portfolio_delete_button’
    gstalker.h:282: warning: data definition has no type or storage class
    gstalker.h:283: error: syntax error before ‘*’ token
    gstalker.h:283: warning: type defaults to ‘int’ in declaration of ‘portfolio_profit’
    gstalker.h:283: warning: data definition has no type or storage class
    gstalker.h:284: error: syntax error before ‘*’ token
    gstalker.h:284: warning: type defaults to ‘int’ in declaration of ‘portfolio_loss’
    gstalker.h:284: warning: data definition has no type or storage class
    gstalker.h:285: error: syntax error before ‘*’ token
    gstalker.h:285: warning: type defaults to ‘int’ in declaration of ‘portfolio_value’
    gstalker.h:285: warning: data definition has no type or storage class
    gstalker.h:286: error: syntax error before ‘*’ token
    gstalker.h:286: warning: type defaults to ‘int’ in declaration of ‘portfolio_futures_combo’
    gstalker.h:286: warning: data definition has no type or storage class
    gstalker.h:287: error: syntax error before ‘*’ token
    gstalker.h:287: warning: type defaults to ‘int’ in declaration of ‘portfolio_margin_spinner’
    gstalker.h:287: warning: data definition has no type or storage class
    gstalker.h:288: error: syntax error before ‘*’ token
    gstalker.h:288: warning: type defaults to ‘int’ in declaration of ‘portfolio_maint_spinner’
    gstalker.h:288: warning: data definition has no type or storage class
    gstalker.h:289: error: syntax error before ‘*’ token
    gstalker.h:289: warning: type defaults to ‘int’ in declaration of ‘portfolio_margin’
    gstalker.h:289: warning: data definition has no type or storage class
    gstalker.h:290: error: syntax error before ‘*’ token
    gstalker.h:290: warning: type defaults to ‘int’ in declaration of ‘portfolio_tick_spinner’
    gstalker.h:290: warning: data definition has no type or storage class
    gstalker.h:291: error: syntax error before ‘*’ token
    gstalker.h:291: warning: type defaults to ‘int’ in declaration of ‘portfolio_totalpl’
    gstalker.h:291: warning: data definition has no type or storage class
    gstalker.h:294: error: syntax error before ‘*’ token
    gstalker.h:294: warning: type defaults to ‘int’ in declaration of ‘edit_chart_object_window’
    gstalker.h:294: warning: data definition has no type or storage class
    gstalker.h:295: error: syntax error before ‘*’ token
    gstalker.h:295: warning: type defaults to ‘int’ in declaration of ‘edit_chart_object_font’
    gstalker.h:295: warning: data definition has no type or storage class
    gstalker.h:296: error: syntax error before ‘*’ token
    gstalker.h:296: warning: type defaults to ‘int’ in declaration of ‘edit_chart_object_text’
    gstalker.h:296: warning: data definition has no type or storage class
    gstalker.h:299: error: syntax error before ‘*’ token
    gstalker.h:299: warning: type defaults to ‘int’ in declaration of ‘chart_object_window’
    gstalker.h:299: warning: data definition has no type or storage class
    gstalker.h:300: error: syntax error before ‘*’ token
    gstalker.h:300: warning: type defaults to ‘int’ in declaration of ‘chart_object_clist’
    gstalker.h:300: warning: data definition has no type or storage class
    gstalker.h:301: error: syntax error before ‘*’ token
    gstalker.h:301: warning: type defaults to ‘int’ in declaration of ‘chart_object_edit_button’
    gstalker.h:301: warning: data definition has no type or storage class
    gstalker.h:302: error: syntax error before ‘*’ token
    gstalker.h:302: warning: type defaults to ‘int’ in declaration of ‘chart_object_delete_button’
    gstalker.h:302: warning: data definition has no type or storage class
    gstalker.h:305: error: syntax error before ‘*’ token
    gstalker.h:305: warning: type defaults to ‘int’ in declaration of ‘export_dialog’
    gstalker.h:305: warning: data definition has no type or storage class
    gstalker.h:306: error: syntax error before ‘*’ token
    gstalker.h:306: warning: type defaults to ‘int’ in declaration of ‘export_entry’
    gstalker.h:306: warning: data definition has no type or storage class
    gstalker.h:307: error: syntax error before ‘*’ token
    gstalker.h:307: warning: type defaults to ‘int’ in declaration of ‘export_clist’
    gstalker.h:307: warning: data definition has no type or storage class
    gstalker.h:308: error: syntax error before ‘*’ token
    gstalker.h:308: warning: type defaults to ‘int’ in declaration of ‘export_all’
    gstalker.h:308: warning: data definition has no type or storage class
    gstalker.h:311: error: syntax error before ‘*’ token
    gstalker.h:311: warning: type defaults to ‘int’ in declaration of ‘toolbar’
    gstalker.h:311: warning: data definition has no type or storage class
    gstalker.h:312: error: syntax error before ‘*’ token
    gstalker.h:312: warning: type defaults to ‘int’ in declaration of ‘tb_workwith_button’
    gstalker.h:312: warning: data definition has no type or storage class
    gstalker.h:313: error: syntax error before ‘*’ token
    gstalker.h:313: warning: type defaults to ‘int’ in declaration of ‘tb_previous_button’
    gstalker.h:313: warning: data definition has no type or storage class
    gstalker.h:314: error: syntax error before ‘*’ token
    gstalker.h:314: warning: type defaults to ‘int’ in declaration of ‘tb_goto_combo’
    gstalker.h:314: warning: data definition has no type or storage class
    gstalker.h:315: error: syntax error before ‘*’ token
    gstalker.h:315: warning: type defaults to ‘int’ in declaration of ‘tb_goto_entry’
    gstalker.h:315: warning: data definition has no type or storage class
    gstalker.h:316: error: syntax error before ‘*’ token
    gstalker.h:316: warning: type defaults to ‘int’ in declaration of ‘tb_next_button’
    gstalker.h:316: warning: data definition has no type or storage class
    gstalker.h:317: error: syntax error before ‘*’ token
    gstalker.h:317: warning: type defaults to ‘int’ in declaration of ‘tb_compress_button’
    gstalker.h:317: warning: data definition has no type or storage class
    gstalker.h:318: error: syntax error before ‘*’ token
    gstalker.h:318: warning: type defaults to ‘int’ in declaration of ‘tb_expand_button’
    gstalker.h:318: warning: data definition has no type or storage class
    gstalker.h:319: error: syntax error before ‘*’ token
    gstalker.h:319: warning: type defaults to ‘int’ in declaration of ‘tb_new_indicator_button’
    gstalker.h:319: warning: data definition has no type or storage class
    gstalker.h:323: error: syntax error before ‘*’ token
    gstalker.h:323: warning: type defaults to ‘int’ in declaration of ‘tb_quote_button’
    gstalker.h:323: warning: data definition has no type or storage class
    gstalker.h:324: error: syntax error before ‘*’ token
    gstalker.h:324: warning: type defaults to ‘int’ in declaration of ‘tb_monitor_button’
    gstalker.h:324: warning: data definition has no type or storage class
    gstalker.h:325: error: syntax error before ‘*’ token
    gstalker.h:325: warning: type defaults to ‘int’ in declaration of ‘tb_portfolio_button’
    gstalker.h:325: warning: data definition has no type or storage class
    gstalker.h:326: error: syntax error before ‘*’ token
    gstalker.h:326: warning: type defaults to ‘int’ in declaration of ‘tb_data_button’
    gstalker.h:326: warning: data definition has no type or storage class
    gstalker.h:327: error: syntax error before ‘*’ token
    gstalker.h:327: warning: type defaults to ‘int’ in declaration of ‘tb_edit_indicator_button’
    gstalker.h:327: warning: data definition has no type or storage class
    gstalker.h:328: error: syntax error before ‘*’ token
    gstalker.h:328: warning: type defaults to ‘int’ in declaration of ‘tb_grid_button’
    gstalker.h:328: warning: data definition has no type or storage class
    gstalker.h:329: error: syntax error before ‘*’ token
    gstalker.h:329: warning: type defaults to ‘int’ in declaration of ‘tb_dwm_button’
    gstalker.h:329: warning: data definition has no type or storage class
    gstalker.h:330: error: syntax error before ‘*’ token
    gstalker.h:330: warning: type defaults to ‘int’ in declaration of ‘tb_edit_chart_button’
    gstalker.h:330: warning: data definition has no type or storage class
    gstalker.h:331: error: syntax error before ‘}’ token
    main.c:28: error: syntax error before ‘main’
    main.c:28: error: syntax error before ‘argc’
    main.c:29: warning: return type defaults to ‘int’
    main.c: In function ‘main’:
    main.c:31: error: ‘GtkWidget’ undeclared (first use in this function)
    main.c:31: error: (Each undeclared identifier is reported only once
    main.c:31: error: for each function it appears in.)
    main.c:31: error: ‘hbox’ undeclared (first use in this function)
    main.c:33: error: ‘sw’ undeclared (first use in this function)
    main.c:34: error: ‘sw2’ undeclared (first use in this function)
    main.c:42: error: ‘argc’ undeclared (first use in this function)
    main.c:42: error: ‘argv’ undeclared (first use in this function)
    main.c:42: warning: passing argument 2 of ‘gnome_init’ from incompatible pointer type
    main.c:42: error: too few arguments to function ‘gnome_init’
    main.c:54: warning: implicit declaration of function ‘gnome_master_client’
    main.c:54: warning: assignment makes pointer from integer without a cast
    main.c:55: warning: implicit declaration of function ‘gtk_signal_connect’
    main.c:55: warning: implicit declaration of function ‘GTK_OBJECT’
    main.c:56: warning: implicit declaration of function ‘GTK_SIGNAL_FUNC’
    main.c:61: error: invalid use of undefined type ‘struct _config’
    main.c:62: warning: implicit declaration of function ‘gtk_window_set_wmclass’
    main.c:62: warning: implicit declaration of function ‘GTK_WINDOW’
    main.c:62: error: invalid use of undefined type ‘struct _config’
    main.c:65: warning: implicit declaration of function ‘gtk_widget_realize’
    main.c:65: error: invalid use of undefined type ‘struct _config’
    main.c:66: error: invalid use of undefined type ‘struct _config’
    main.c:68: warning: implicit declaration of function ‘gtk_window_set_default_size’
    main.c:68: error: invalid use of undefined type ‘struct _config’
    main.c:70: warning: implicit declaration of function ‘gtk_vbox_new’
    main.c:70: error: ‘FALSE’ undeclared (first use in this function)
    main.c:70: warning: assignment makes pointer from integer without a cast
    main.c:71: warning: implicit declaration of function ‘GTK_CHECK_CAST’
    main.c:71: error: invalid use of undefined type ‘struct _config’
    main.c:71: error: syntax error before ‘GnomeApp’
    main.c:73: error: invalid use of undefined type ‘struct _config’
    main.c:73: warning: implicit declaration of function ‘gtk_statusbar_new’
    main.c:74: warning: implicit declaration of function ‘gtk_box_pack_start’
    main.c:74: warning: implicit declaration of function ‘GTK_BOX’
    main.c:74: error: invalid use of undefined type ‘struct _config’
    main.c:74: error: ‘TRUE’ undeclared (first use in this function)
    main.c:76: warning: implicit declaration of function ‘gtk_hbox_new’
    main.c:81: error: invalid use of undefined type ‘struct _config’
    main.c:81: error: syntax error before ‘GnomeApp’
    main.c:84: warning: implicit declaration of function ‘gtk_scrolled_window_new’
    main.c:86: warning: implicit declaration of function ‘gtk_scrolled_window_set_policy’
    main.c:86: warning: implicit declaration of function ‘GTK_SCROLLED_WINDOW’
    main.c:86: error: ‘GTK_POLICY_ALWAYS’ undeclared (first use in this function)
    main.c:86: error: ‘GTK_POLICY_AUTOMATIC’ undeclared (first use in this function)
    main.c:88: error: invalid use of undefined type ‘struct _config’
    main.c:88: warning: implicit declaration of function ‘gtk_drawing_area_new’
    main.c:89: error: invalid use of undefined type ‘struct _config’
    main.c:90: error: ‘GtkSignalFunc’ undeclared (first use in this function)
    main.c:90: error: syntax error before ‘expose_event’
    main.c:92: error: invalid use of undefined type ‘struct _config’
    main.c:93: error: syntax error before ‘configure_event’
    main.c:100: error: invalid use of undefined type ‘struct _config’
    main.c:101: error: syntax error before ‘button_press_event’
    main.c:108: warning: implicit declaration of function ‘gtk_widget_set_events’
    main.c:108: error: invalid use of undefined type ‘struct _config’
    main.c:109: error: ‘GDK_EXPOSURE_MASK’ undeclared (first use in this function)
    main.c:110: error: ‘GDK_LEAVE_NOTIFY_MASK’ undeclared (first use in this function)
    main.c:111: error: ‘GDK_BUTTON_PRESS_MASK’ undeclared (first use in this function)
    main.c:111: error: ‘GDK_BUTTON_RELEASE_MASK’ undeclared (first use in this function)
    main.c:116: warning: implicit declaration of function ‘gtk_scrolled_window_add_with_viewport’
    main.c:116: error: invalid use of undefined type ‘struct _config’
    main.c:119: warning: implicit declaration of function ‘gtk_widget_set_usize’
    main.c:120: warning: implicit declaration of function ‘gtk_box_pack_end’
    main.c:121: error: ‘GTK_POLICY_NEVER’ undeclared (first use in this function)
    main.c:123: error: invalid use of undefined type ‘struct _config’
    main.c:124: error: invalid use of undefined type ‘struct _config’
    main.c:125: error: syntax error before ‘expose_event’
    main.c:127: error: invalid use of undefined type ‘struct _config’
    main.c:128: error: syntax error before ‘configure_event’
    main.c:130: error: invalid use of undefined type ‘struct _config’
    main.c:131: error: invalid use of undefined type ‘struct _config’
    main.c:134: error: invalid use of undefined type ‘struct _config’
    main.c:134: warning: implicit declaration of function ‘gnome_appbar_new’
    main.c:134: error: ‘GNOME_PREFERENCES_NEVER’ undeclared (first use in this function)
    main.c:135: error: invalid use of undefined type ‘struct _config’
    main.c:135: error: syntax error before ‘GnomeApp’
    main.c:141: warning: implicit declaration of function ‘gtk_widget_show_all’
    main.c:141: error: invalid use of undefined type ‘struct _config’
    main.c:143: warning: implicit declaration of function ‘gtk_main’
    make[1]: *** [main.o] Error 1
    make[1]: Leaving directory `/usr/local/gstalker/src'
    make: *** [install-recursive] Error 1

    Was jetzt?
     
  5. #4 tuxlover, 04.02.2006
    Zuletzt bearbeitet: 04.02.2006
    tuxlover

    tuxlover Der den Tux knuddelt

    Dabei seit:
    26.10.2005
    Beiträge:
    2.106
    Zustimmungen:
    0
    Ort:
    berlin
    hast du bemerkt dass deine c biblioteken immer mit main.c:n (n= Zahl z.b. main.c:35) enden? das kommt mir komisch vor. notfalls nochmal neu installieren. welche distro besitzt du. gibt es vielleicht andere möglichkeiten das zu installieren z.b mit rpm oder deb paketen.

    ps das sind einfach zu viele fehler unmöglich da weiß man ja gar nicht wo man anfangen soll
     
  6. #5 pacific, 04.02.2006
    pacific

    pacific Jungspund

    Dabei seit:
    04.02.2006
    Beiträge:
    11
    Zustimmungen:
    0
    Ich habe die SUSE 10

    Ich benutze Tar, da es keine rpm oder deb Packete in der aktuellen Version gibt. Jetzt lasse ich gerade ein SUSE Update laufen (über 400 MB).

    Ich kann zwar RedHat, Aurox oder FreeBSD installieren, dort hatte ich aber ständig mit der Installation von fehlenden Lib `s zu tun. Deshalb bin ich jetzt zurück auf SUSE. Ich versuche es nach dem Updaten erneut. Danke für Deine Hilfe bzw. für Deine weitere Unterstützung
     
  7. #6 tuxlover, 04.02.2006
    Zuletzt bearbeitet: 04.02.2006
    tuxlover

    tuxlover Der den Tux knuddelt

    Dabei seit:
    26.10.2005
    Beiträge:
    2.106
    Zustimmungen:
    0
    Ort:
    berlin
    ich trottel der dopplepunkt gibt natürlich die zeile an, in der der fehler in der entsprechenden datei auftaucht.

    schick mal das readme bzw. die installtionsanleitung.

    ausserdem solltest du vielleicht mal bei http://gnome.org/start/2.12/ vorbeischauen. da solltest es ja die aktuellen libs geben.
     
  8. #7 pacific, 04.02.2006
    pacific

    pacific Jungspund

    Dabei seit:
    04.02.2006
    Beiträge:
    11
    Zustimmungen:
    0
    <b>Readme</b>
    This is my contribution to the Linux universe.

    Ok kids, so ya like that stock charting? Because I'm sick of rebooting to Windoze
    just to run my stock charting software (everything else strictly Linux) and also because
    I couldn't find any GPL'd software that wasn't more than just hacks and stuff, I decided
    to write my own stock charting software. Mind you, this was originally written for myself,
    and later re-written for a public release, so some things might seem a little awkward or unusual.



    Description
    ===========

    gstalker is a program that enables you to visually chart stock and commoditiy prices.
    It is very similar to commercial software such as metastok and superchartz. It is designed
    to be simple and easy to use, and light on resources.

    gstalker has also been designed to run at least at a 800 x 600 resolution, if you are
    running at lower resolution, I advise against it. gstalker will be quite annoying at anything
    lower. There's nothing stopping you if you want, but menus and graphs will look ugly.
    It's up to you.


    Directories & Files
    ===================
    o AUTHORS contains those who have contributed patches.
    o INSTALL contains installation instructions.
    o CHANGELOG contains the changes since the last version.
    o BUGS contains a list of the currently known bugs.
    o FAQ is a list of frequently asked questions.
    o TODO is a wish list of features and improvements planned for future releases.


    gstalker Directories & Files
    ============================

    When gstalker is started for the first time, it will create all the directories and files
    needed for normal operation. They are:

    ~/gstalker/config - config file
    ~/gstalker/ - temp files and will be created here
    ~/gstalker/data/ - DB files, all charts created are stored here
    ~/gstalker/group/ - DB file, groups created are stored here
    ~/gstalker/header/ - DB file, chart headers are stored here
    ~/gstalker/import_rules - DB file, all rules used for importing data
    ~/gstalker/portfolio - DB file, portfolio data stored here
    ~/gstalker/currency - DB file, currency data stored here
    ~/gstalker/futures - DB file, futures data stored here
    ~/gstalker/monitor_list - DB file, monitor group data stored here


    To compile the source:
    ======================

    Packages you will need to use gstalker:

    1) GNOME =>1.2
    2) libstocks (find it at freshmeat.net)
    3) Berkelely DB version 2.1 - 2.7.7 (version 3.* is not supported yet)
    If you use version Berkely DB version 2.7.7, you must edit the /src/define.h file before you compile.
    Uncomment the #define DB_2_7_7 line at the top of the file.

    1) ./configure
    2) make
    3) copy the /src/gstalker and /monitor/gstalker-monitor executable files to any dir your shell search
    path can find it. eg /usr/bin, /usr/local/bin etc.
    4) That's it.

    <b>Install</b>
    Basic Installation
    ==================

    These are generic installation instructions.

    The `configure' shell script attempts to guess correct values for
    various system-dependent variables used during compilation. It uses
    those values to create a `Makefile' in each directory of the package.
    It may also create one or more `.h' files containing system-dependent
    definitions. Finally, it creates a shell script `config.status' that
    you can run in the future to recreate the current configuration, a file
    `config.cache' that saves the results of its tests to speed up
    reconfiguring, and a file `config.log' containing compiler output
    (useful mainly for debugging `configure').

    If you need to do unusual things to compile the package, please try
    to figure out how `configure' could check whether to do them, and mail
    diffs or instructions to the address given in the `README' so they can
    be considered for the next release. If at some point `config.cache'
    contains results you don't want to keep, you may remove or edit it.

    The file `configure.in' is used to create `configure' by a program
    called `autoconf'. You only need `configure.in' if you want to change
    it or regenerate `configure' using a newer version of `autoconf'.

    The simplest way to compile this package is:

    1. `cd' to the directory containing the package's source code and type
    `./configure' to configure the package for your system. If you're
    using `csh' on an old version of System V, you might need to type
    `sh ./configure' instead to prevent `csh' from trying to execute
    `configure' itself.

    Running `configure' takes awhile. While running, it prints some
    messages telling which features it is checking for.

    2. Type `make' to compile the package.

    3. Optionally, type `make check' to run any self-tests that come with
    the package.

    4. Type `make install' to install the programs and any data files and
    documentation.

    5. You can remove the program binaries and object files from the
    source code directory by typing `make clean'. To also remove the
    files that `configure' created (so you can compile the package for
    a different kind of computer), type `make distclean'. There is
    also a `make maintainer-clean' target, but that is intended mainly
    for the package's developers. If you use it, you may have to get
    all sorts of other programs in order to regenerate files that came
    with the distribution.

    Compilers and Options
    =====================

    Some systems require unusual options for compilation or linking that
    the `configure' script does not know about. You can give `configure'
    initial values for variables by setting them in the environment. Using
    a Bourne-compatible shell, you can do that on the command line like
    this:
    CC=c89 CFLAGS=-O2 LIBS=-lposix ./configure

    Or on systems that have the `env' program, you can do it like this:
    env CPPFLAGS=-I/usr/local/include LDFLAGS=-s ./configure

    Compiling For Multiple Architectures
    ====================================

    You can compile the package for more than one kind of computer at the
    same time, by placing the object files for each architecture in their
    own directory. To do this, you must use a version of `make' that
    supports the `VPATH' variable, such as GNU `make'. `cd' to the
    directory where you want the object files and executables to go and run
    the `configure' script. `configure' automatically checks for the
    source code in the directory that `configure' is in and in `..'.

    If you have to use a `make' that does not supports the `VPATH'
    variable, you have to compile the package for one architecture at a time
    in the source code directory. After you have installed the package for
    one architecture, use `make distclean' before reconfiguring for another
    architecture.

    Installation Names
    ==================

    By default, `make install' will install the package's files in
    `/usr/local/bin', `/usr/local/man', etc. You can specify an
    installation prefix other than `/usr/local' by giving `configure' the
    option `--prefix=PATH'.

    You can specify separate installation prefixes for
    architecture-specific files and architecture-independent files. If you
    give `configure' the option `--exec-prefix=PATH', the package will use
    PATH as the prefix for installing programs and libraries.
    Documentation and other data files will still use the regular prefix.

    In addition, if you use an unusual directory layout you can give
    options like `--bindir=PATH' to specify different values for particular
    kinds of files. Run `configure --help' for a list of the directories
    you can set and what kinds of files go in them.

    If the package supports it, you can cause programs to be installed
    with an extra prefix or suffix on their names by giving `configure' the
    option `--program-prefix=PREFIX' or `--program-suffix=SUFFIX'.

    Optional Features
    =================

    Some packages pay attention to `--enable-FEATURE' options to
    `configure', where FEATURE indicates an optional part of the package.
    They may also pay attention to `--with-PACKAGE' options, where PACKAGE
    is something like `gnu-as' or `x' (for the X Window System). The
    `README' should mention any `--enable-' and `--with-' options that the
    package recognizes.

    For packages that use the X Window System, `configure' can usually
    find the X include and library files automatically, but if it doesn't,
    you can use the `configure' options `--x-includes=DIR' and
    `--x-libraries=DIR' to specify their locations.

    Specifying the System Type
    ==========================

    There may be some features `configure' can not figure out
    automatically, but needs to determine by the type of host the package
    will run on. Usually `configure' can figure that out, but if it prints
    a message saying it can not guess the host type, give it the
    `--host=TYPE' option. TYPE can either be a short name for the system
    type, such as `sun4', or a canonical name with three fields:
    CPU-COMPANY-SYSTEM

    See the file `config.sub' for the possible values of each field. If
    `config.sub' isn't included in this package, then this package doesn't
    need to know the host type.

    If you are building compiler tools for cross-compiling, you can also
    use the `--target=TYPE' option to select the type of system they will
    produce code for and the `--build=TYPE' option to select the type of
    system on which you are compiling the package.

    Sharing Defaults
    ================

    If you want to set default values for `configure' scripts to share,
    you can create a site shell script called `config.site' that gives
    default values for variables like `CC', `cache_file', and `prefix'.
    `configure' looks for `PREFIX/share/config.site' if it exists, then
    `PREFIX/etc/config.site' if it exists. Or, you can set the
    `CONFIG_SITE' environment variable to the location of the site script.
    A warning: not all `configure' scripts look for a site script.

    Operation Controls
    ==================

    `configure' recognizes the following options to control how it
    operates.

    `--cache-file=FILE'
    Use and save the results of the tests in FILE instead of
    `./config.cache'. Set FILE to `/dev/null' to disable caching, for
    debugging `configure'.

    `--help'
    Print a summary of the options to `configure', and exit.

    `--quiet'
    `--silent'
    `-q'
    Do not print messages saying which checks are being made. To
    suppress all normal output, redirect it to `/dev/null' (any error
    messages will still be shown).

    `--srcdir=DIR'
    Look for the package's source code in directory DIR. Usually
    `configure' can determine that directory automatically.

    `--version'
    Print the version of Autoconf used to generate the `configure'
    script, and exit.

    `configure' also accepts some other, not widely useful, options.
     
  9. #8 tuxlover, 04.02.2006
    Zuletzt bearbeitet: 04.02.2006
    tuxlover

    tuxlover Der den Tux knuddelt

    Dabei seit:
    26.10.2005
    Beiträge:
    2.106
    Zustimmungen:
    0
    Ort:
    berlin
    ich werde mal versuchen es selber zu compilieren. es wird also ein paar tage dauern bis du eine antwort auf diese frage erhalten wirst, da ich selber kein internet habe. wo hast du es denn her. unter der webadresse gibt es verschiedene versionen welches hast du genommen. poste mal den link.

    hier ist noch eine möglichkeit deine rpms zu kriegen. weißt du wie man debs in rpms umwandelt, es gibt debs dafür bei rpmseek
     
  10. #9 pacific, 04.02.2006
    pacific

    pacific Jungspund

    Dabei seit:
    04.02.2006
    Beiträge:
    11
    Zustimmungen:
    0
    Ich habe gerade die libstocks down geladen.

    Eventuell ist diese die Original als Tar. Bei rpmpbone hatte ich ein rpm gefunden.
    Wenn mein Update fertig ist, dann versuche ich es mit der libstocks.tar
     
  11. #10 webstar, 05.02.2006
    webstar

    webstar LFS-Junkie/ExRPMbuilder

    Dabei seit:
    12.04.2004
    Beiträge:
    46
    Zustimmungen:
    0
    Ort:
    Aus dem schönen Elbflorenz
    Das sind Source-RPM-Pakete!
    Diese dienen als Grundlage für neue(aktuellere)Binary-RPM's, oder zum rebuilden.
    Sind als nicht für die normale RPM-Installation geeignet.
    Sie enthalten nur den Source-Code, Patches und das für den RPM-Bau erforderliche SPEC-File.
    Probier mal hier nach der Datei gnomeConf.sh zu suchen:
    http://search.rpmseek.com/search.html?hl=de

    Schönen Tag noch, man liest sich.:)
    Euer Jens Ornot alias Webstar
     
  12. Anzeige

    Vielleicht findest du HIER Antworten.
    Registrieren bzw. einloggen, um diese und auch andere Anzeigen zu deaktivieren
  13. #11 pacific, 05.02.2006
    pacific

    pacific Jungspund

    Dabei seit:
    04.02.2006
    Beiträge:
    11
    Zustimmungen:
    0
    Finde dort nur Debian Packete. Jetzt komme ich ins krübeln.
    Früher konnte kpackage in der SUSE auch Debian Packete einlesen. Heute fehlt diese Funktion. Welchen Packetmanager sollte ich nachinstallieren?

    Synamtic?

    Oder öffne ich dieses Packet im Archivier und nutze die Tar?
     
  14. #12 webstar, 05.02.2006
    webstar

    webstar LFS-Junkie/ExRPMbuilder

    Dabei seit:
    12.04.2004
    Beiträge:
    46
    Zustimmungen:
    0
    Ort:
    Aus dem schönen Elbflorenz
    Und was ist das hier:
    http://rpmseek.com/rpm-pl/gnome-libs-devel.html?hl=de&cs=gnomeConf.sh:FN:3,5:11:1:0

    Schönen Tag noch, man liest sich. :)
    Euer Jens Ornot alias Webstar
     
Thema:

Wo finde ich Gnome Libs " gnomeConf.sh "

Die Seite wird geladen...

Wo finde ich Gnome Libs " gnomeConf.sh " - Ähnliche Themen

  1. GNOME- und KDE-Konferenzen sollen gemeinsam stattfinden

    GNOME- und KDE-Konferenzen sollen gemeinsam stattfinden: GNOME und KDE wollen ab 2009 ihre Anwender- und Entwicklungskonferenzen am gleichen Ort stattfinden lassen. Weiterlesen...
  2. Wo befindet sich der Autostartordner?

    Wo befindet sich der Autostartordner?: Hallo ich habe CentOS 7.2.15.11 und Desktopumgebung mate , wo befindet sich der Autostartordner?
  3. Rechner im lokalen Netzwerk finden

    Rechner im lokalen Netzwerk finden: Hallo, in meiner Firma habe ich zwei Linux-Rechner, die ganz modern mit dem Internet verbunden sind. Jetzt möchte ich von dem einem Rechner...
  4. BSI-Audit findet keine akuten Probleme in OpenSSL

    BSI-Audit findet keine akuten Probleme in OpenSSL: Das Bundesamt für Sicherheit in der Informationstechnik hat OpenSSL auf seine Sicherheit untersuchen lassen. Die Analyse zeigt vor allem, dass die...
  5. BSI-Audit findet keine akute Probleme in OpenSSL

    BSI-Audit findet keine akute Probleme in OpenSSL: Das Bundesamt für Sicherheit in der Informationstechnik hat OpenSSL auf seine Sicherheit untersuchen lassen. Die Analyse zeigt vor allem, dass die...