Superkaramba @ Debian FEHLER????

Dieses Thema im Forum "KDE" wurde erstellt von XET!C, 07.01.2007.

  1. XET!C

    XET!C Tripel-As

    Dabei seit:
    02.08.2006
    Beiträge:
    191
    Zustimmungen:
    0
    Ort:
    Alfter / Bonn
    Hi,

    ich hab mir SUPERKARAMBA 0.39 heruntergeladen. Habe KDE 3.5 @ Debian Sarge.
    Habe SK entpackt und im Terminal unter su ./configure ausgeführt. Dann kam diese Meldung
    Code:
    XETIC:/home/xetic/superkaramba-0.39# ./configure
    checking build system type... i686-pc-linux-gnu
    checking host system type... i686-pc-linux-gnu
    checking target system type... i686-pc-linux-gnu
    checking for a BSD-compatible install... /usr/bin/install -c
    checking for -p flag to install... yes
    checking whether build environment is sane... yes
    checking for gawk... no
    checking for mawk... mawk
    checking whether make sets $(MAKE)... yes
    checking for kde-config... /usr/bin/kde-config
    checking where to install... /usr (as returned by kde-config)
    checking for style of include used by make... GNU
    checking for gcc... gcc
    checking for C compiler default output file name... a.out
    checking whether the C compiler works... yes
    checking whether we are cross compiling... no
    checking for suffix of executables...
    checking for suffix of object files... o
    checking whether we are using the GNU C compiler... yes
    checking whether gcc accepts -g... yes
    checking for gcc option to accept ANSI C... none needed
    checking dependency style of gcc... gcc3
    checking how to run the C preprocessor... gcc -E
    checking for g++... g++
    checking whether we are using the GNU C++ compiler... yes
    checking whether g++ accepts -g... yes
    checking dependency style of g++... gcc3
    checking whether gcc is blacklisted... no
    checking whether g++ supports -Wmissing-format-attribute... yes
    checking whether gcc supports -Wmissing-format-attribute... yes
    checking whether g++ supports -Wundef... yes
    checking whether g++ supports -Wno-long-long... yes
    checking whether g++ supports -Wno-non-virtual-dtor... yes
    checking whether g++ supports -fno-reorder-blocks... yes
    checking whether g++ supports -fno-exceptions... yes
    checking whether g++ supports -fno-check-new... yes
    checking whether g++ supports -fno-common... yes
    checking whether g++ supports -fexceptions... yes
    checking whether system headers can cope with -O2 -fno-inline... irrelevant
    checking how to run the C++ preprocessor... g++ -E
    checking whether g++ supports -O0... yes
    checking whether g++ supports -Wl,--no-undefined... yes
    checking whether g++ supports -Wl,--allow-shlib-undefined... yes
    not using lib directory suffix
    checking for a sed that does not truncate output... /bin/sed
    checking for egrep... grep -E
    checking for ld used by gcc... /usr/bin/ld
    checking if the linker (/usr/bin/ld) is GNU ld... yes
    checking for /usr/bin/ld option to reload object files... -r
    checking for BSD-compatible nm... /usr/bin/nm -B
    checking whether ln -s works... yes
    checking how to recognise dependent libraries... pass_all
    checking for ANSI C header files... yes
    checking for sys/types.h... yes
    checking for sys/stat.h... yes
    checking for stdlib.h... yes
    checking for string.h... yes
    checking for memory.h... yes
    checking for strings.h... yes
    checking for inttypes.h... yes
    checking for stdint.h... yes
    checking for unistd.h... yes
    checking dlfcn.h usability... yes
    checking dlfcn.h presence... yes
    checking for dlfcn.h... yes
    checking for g77... no
    checking for f77... no
    checking for xlf... no
    checking for frt... no
    checking for pgf77... no
    checking for fort77... no
    checking for fl32... no
    checking for af77... no
    checking for f90... no
    checking for xlf90... no
    checking for pgf90... no
    checking for epcf90... no
    checking for f95... no
    checking for fort... no
    checking for xlf95... no
    checking for ifc... no
    checking for efc... no
    checking for pgf95... no
    checking for lf95... no
    checking for gfortran... no
    checking whether we are using the GNU Fortran 77 compiler... no
    checking whether  accepts -g... no
    checking the maximum length of command line arguments... 32768
    checking command to parse /usr/bin/nm -B output from gcc object... ok
    checking for objdir... .libs
    checking for ar... ar
    checking for ranlib... ranlib
    checking for strip... strip
    checking if gcc static flag  works... yes
    checking if gcc supports -fno-rtti -fno-exceptions... no
    checking for gcc option to produce PIC... -fPIC
    checking if gcc PIC flag -fPIC works... yes
    checking if gcc supports -c -o file.o... yes
    checking whether the gcc linker (/usr/bin/ld) supports shared libraries... yes
    checking whether -lc should be explicitly linked in... no
    checking dynamic linker characteristics... GNU/Linux ld.so
    checking how to hardcode library paths into programs... immediate
    checking whether stripping libraries is possible... yes
    checking for shl_load... no
    checking for shl_load in -ldld... no
    checking for dlopen... no
    checking for dlopen in -ldl... yes
    checking whether a program can dlopen itself... yes
    checking whether a statically linked program can dlopen itself... yes
    checking if libtool supports shared libraries... yes
    checking whether to build shared libraries... yes
    checking whether to build static libraries... no
    configure: creating libtool
    appending configuration tag "CXX" to libtool
    checking for ld used by g++... /usr/bin/ld
    checking if the linker (/usr/bin/ld) is GNU ld... yes
    checking whether the g++ linker (/usr/bin/ld) supports shared libraries... yes
    checking for g++ option to produce PIC... -fPIC
    checking if g++ PIC flag -fPIC works... yes
    checking if g++ supports -c -o file.o... yes
    checking whether the g++ linker (/usr/bin/ld) supports shared libraries... yes
    checking dynamic linker characteristics... GNU/Linux ld.so
    checking how to hardcode library paths into programs... immediate
    checking whether stripping libraries is possible... yes
    checking for shl_load... (cached) no
    checking for shl_load in -ldld... (cached) no
    checking for dlopen... (cached) no
    checking for dlopen in -ldl... (cached) yes
    checking whether a program can dlopen itself... (cached) yes
    checking whether a statically linked program can dlopen itself... (cached) yes
    appending configuration tag "F77" to libtool
    checking for msgfmt... /usr/bin/msgfmt
    checking for gmsgfmt... /usr/bin/msgfmt
    checking for xgettext... /usr/bin/xgettext
    checking if C++ programs can be compiled... yes
    checking for strlcat... no
    checking if strlcat needs custom prototype... yes - in libkdefakes
    checking for strlcpy... no
    checking if strlcpy needs custom prototype... yes - in libkdefakes
    checking for main in -lutil... yes
    checking for main in -lcompat... no
    checking for crypt in -lcrypt... yes
    checking for socklen_t... yes
    checking for dnet_ntoa in -ldnet... no
    checking for dnet_ntoa in -ldnet_stub... no
    checking for inet_ntoa... yes
    checking for connect... yes
    checking for remove... yes
    checking for shmat... yes
    checking for sys/types.h... (cached) yes
    checking for stdint.h... (cached) yes
    checking sys/bitypes.h usability... yes
    checking sys/bitypes.h presence... yes
    checking for sys/bitypes.h... yes
    checking for poll in -lpoll... no
    checking Carbon/Carbon.h usability... no
    checking Carbon/Carbon.h presence... no
    checking for Carbon/Carbon.h... no
    checking CoreAudio/CoreAudio.h usability... no
    checking CoreAudio/CoreAudio.h presence... no
    checking for CoreAudio/CoreAudio.h... no
    checking if res_init needs -lresolv... yes
    checking for res_init... yes
    checking if res_init needs custom prototype... no
    checking for killpg in -lucb... no
    checking for int... yes
    checking size of int... 4
    checking for short... yes
    checking size of short... 2
    checking for long... yes
    checking size of long... 4
    checking for char *... yes
    checking size of char *... 4
    checking for dlopen in -ldl... (cached) yes
    checking for shl_unload in -ldld... no
    checking for size_t... yes
    checking size of size_t... 4
    checking for unsigned long... yes
    checking size of unsigned long... 4
    checking sizeof size_t == sizeof unsigned long... yes
    checking for PIE support... no
    checking if enabling -pie/fPIE support... no
    checking crt_externs.h usability... no
    checking crt_externs.h presence... no
    checking for crt_externs.h... no
    checking for _NSGetEnviron... no
    checking for vsnprintf... yes
    checking for snprintf... yes
    checking for X... libraries /usr/X11R6/lib, headers /usr/X11R6/include
    checking for IceConnectionNumber in -lICE... no
    checking for libXext... yes
    checking for pthread_create in -lpthread... yes
    checking for extra includes... no
    checking for extra libs... no
    checking for libz... -lz
    checking for libpng... no
    checking for libjpeg6b... no
    checking for libjpeg... no
    configure: WARNING: libjpeg not found. disable JPEG support.
    checking for perl... /usr/bin/perl
    checking for Qt... configure: error: Qt (>= Qt 3.3 and < 4.0) (headers and libraries) not found. Please check your installation!
    For more details about this problem, look at the end of config.log.
    XETIC:/home/xetic/superkaramba-0.39# vi /etc/ld.so.conf
    Xlib: connection to ":0.0" refused by server
    Xlib: No protocol specified
    
    Xlib: connection to ":0.0" refused by server
    Xlib: No protocol specified
    
    Xlib: connection to ":0.0" refused by server
    Xlib: No protocol specified
    
    XETIC:/home/xetic/superkaramba-0.39# ./configure
    checking build system type... i686-pc-linux-gnu
    checking host system type... i686-pc-linux-gnu
    checking target system type... i686-pc-linux-gnu
    checking for a BSD-compatible install... /usr/bin/install -c
    checking for -p flag to install... yes
    checking whether build environment is sane... yes
    checking for gawk... no
    checking for mawk... mawk
    checking whether make sets $(MAKE)... yes
    checking for kde-config... /usr/bin/kde-config
    checking where to install... /usr (as returned by kde-config)
    checking for style of include used by make... GNU
    checking for gcc... gcc
    checking for C compiler default output file name... a.out
    checking whether the C compiler works... yes
    checking whether we are cross compiling... no
    checking for suffix of executables...
    checking for suffix of object files... o
    checking whether we are using the GNU C compiler... yes
    checking whether gcc accepts -g... yes
    checking for gcc option to accept ANSI C... none needed
    checking dependency style of gcc... gcc3
    checking how to run the C preprocessor... gcc -E
    checking for g++... g++
    checking whether we are using the GNU C++ compiler... yes
    checking whether g++ accepts -g... yes
    checking dependency style of g++... gcc3
    checking whether gcc is blacklisted... no
    checking whether g++ supports -Wmissing-format-attribute... yes
    checking whether gcc supports -Wmissing-format-attribute... yes
    checking whether g++ supports -Wundef... yes
    checking whether g++ supports -Wno-long-long... yes
    checking whether g++ supports -Wno-non-virtual-dtor... yes
    checking whether g++ supports -fno-reorder-blocks... yes
    checking whether g++ supports -fno-exceptions... yes
    checking whether g++ supports -fno-check-new... yes
    checking whether g++ supports -fno-common... yes
    checking whether g++ supports -fexceptions... yes
    checking whether system headers can cope with -O2 -fno-inline... irrelevant
    checking how to run the C++ preprocessor... g++ -E
    checking whether g++ supports -O0... yes
    checking whether g++ supports -Wl,--no-undefined... yes
    checking whether g++ supports -Wl,--allow-shlib-undefined... yes
    not using lib directory suffix
    checking for a sed that does not truncate output... /bin/sed
    checking for egrep... grep -E
    checking for ld used by gcc... /usr/bin/ld
    checking if the linker (/usr/bin/ld) is GNU ld... yes
    checking for /usr/bin/ld option to reload object files... -r
    checking for BSD-compatible nm... /usr/bin/nm -B
    checking whether ln -s works... yes
    checking how to recognise dependent libraries... pass_all
    checking for ANSI C header files... yes
    checking for sys/types.h... yes
    checking for sys/stat.h... yes
    checking for stdlib.h... yes
    checking for string.h... yes
    checking for memory.h... yes
    checking for strings.h... yes
    checking for inttypes.h... yes
    checking for stdint.h... yes
    checking for unistd.h... yes
    checking dlfcn.h usability... yes
    checking dlfcn.h presence... yes
    checking for dlfcn.h... yes
    checking for g77... no
    checking for f77... no
    checking for xlf... no
    checking for frt... no
    checking for pgf77... no
    checking for fort77... no
    checking for fl32... no
    checking for af77... no
    checking for f90... no
    checking for xlf90... no
    checking for pgf90... no
    checking for epcf90... no
    checking for f95... no
    checking for fort... no
    checking for xlf95... no
    checking for ifc... no
    checking for efc... no
    checking for pgf95... no
    checking for lf95... no
    checking for gfortran... no
    checking whether we are using the GNU Fortran 77 compiler... no
    checking whether  accepts -g... no
    checking the maximum length of command line arguments... 32768
    checking command to parse /usr/bin/nm -B output from gcc object... ok
    checking for objdir... .libs
    checking for ar... ar
    checking for ranlib... ranlib
    checking for strip... strip
    checking if gcc static flag  works... yes
    checking if gcc supports -fno-rtti -fno-exceptions... no
    checking for gcc option to produce PIC... -fPIC
    checking if gcc PIC flag -fPIC works... yes
    checking if gcc supports -c -o file.o... yes
    checking whether the gcc linker (/usr/bin/ld) supports shared libraries... yes
    checking whether -lc should be explicitly linked in... no
    checking dynamic linker characteristics... GNU/Linux ld.so
    checking how to hardcode library paths into programs... immediate
    checking whether stripping libraries is possible... yes
    checking for shl_load... no
    checking for shl_load in -ldld... no
    checking for dlopen... no
    checking for dlopen in -ldl... yes
    checking whether a program can dlopen itself... yes
    checking whether a statically linked program can dlopen itself... yes
    checking if libtool supports shared libraries... yes
    checking whether to build shared libraries... yes
    checking whether to build static libraries... no
    configure: creating libtool
    appending configuration tag "CXX" to libtool
    checking for ld used by g++... /usr/bin/ld
    checking if the linker (/usr/bin/ld) is GNU ld... yes
    checking whether the g++ linker (/usr/bin/ld) supports shared libraries... yes
    checking for g++ option to produce PIC... -fPIC
    checking if g++ PIC flag -fPIC works... yes
    checking if g++ supports -c -o file.o... yes
    checking whether the g++ linker (/usr/bin/ld) supports shared libraries... yes
    checking dynamic linker characteristics... GNU/Linux ld.so
    checking how to hardcode library paths into programs... immediate
    checking whether stripping libraries is possible... yes
    checking for shl_load... (cached) no
    checking for shl_load in -ldld... (cached) no
    checking for dlopen... (cached) no
    checking for dlopen in -ldl... (cached) yes
    checking whether a program can dlopen itself... (cached) yes
    checking whether a statically linked program can dlopen itself... (cached) yes
    appending configuration tag "F77" to libtool
    checking for msgfmt... /usr/bin/msgfmt
    checking for gmsgfmt... /usr/bin/msgfmt
    checking for xgettext... /usr/bin/xgettext
    checking if C++ programs can be compiled... yes
    checking for strlcat... no
    checking if strlcat needs custom prototype... yes - in libkdefakes
    checking for strlcpy... no
    checking if strlcpy needs custom prototype... yes - in libkdefakes
    checking for main in -lutil... yes
    checking for main in -lcompat... no
    checking for crypt in -lcrypt... yes
    checking for socklen_t... yes
    checking for dnet_ntoa in -ldnet... no
    checking for dnet_ntoa in -ldnet_stub... no
    checking for inet_ntoa... yes
    checking for connect... yes
    checking for remove... yes
    checking for shmat... yes
    checking for sys/types.h... (cached) yes
    checking for stdint.h... (cached) yes
    checking sys/bitypes.h usability... yes
    checking sys/bitypes.h presence... yes
    checking for sys/bitypes.h... yes
    checking for poll in -lpoll... no
    checking Carbon/Carbon.h usability... no
    checking Carbon/Carbon.h presence... no
    checking for Carbon/Carbon.h... no
    checking CoreAudio/CoreAudio.h usability... no
    checking CoreAudio/CoreAudio.h presence... no
    checking for CoreAudio/CoreAudio.h... no
    checking if res_init needs -lresolv... yes
    checking for res_init... yes
    checking if res_init needs custom prototype... no
    checking for killpg in -lucb... no
    checking for int... yes
    checking size of int... 4
    checking for short... yes
    checking size of short... 2
    checking for long... yes
    checking size of long... 4
    checking for char *... yes
    checking size of char *... 4
    checking for dlopen in -ldl... (cached) yes
    checking for shl_unload in -ldld... no
    checking for size_t... yes
    checking size of size_t... 4
    checking for unsigned long... yes
    checking size of unsigned long... 4
    checking sizeof size_t == sizeof unsigned long... yes
    checking for PIE support... no
    checking if enabling -pie/fPIE support... no
    checking crt_externs.h usability... no
    checking crt_externs.h presence... no
    checking for crt_externs.h... no
    checking for _NSGetEnviron... no
    checking for vsnprintf... yes
    checking for snprintf... yes
    checking for X... libraries /usr/X11R6/lib, headers /usr/X11R6/include
    checking for IceConnectionNumber in -lICE... no
    checking for libXext... yes
    checking for pthread_create in -lpthread... yes
    checking for extra includes... no
    checking for extra libs... no
    checking for libz... -lz
    checking for libpng... no
    checking for libjpeg6b... no
    checking for libjpeg... no
    configure: WARNING: libjpeg not found. disable JPEG support.
    checking for perl... /usr/bin/perl
    checking for Qt... configure: error: Qt (>= Qt 3.3 and < 4.0) (headers and libraries) not found. Please check your installation!
    For more details about this problem, look at the end of config.log.
    XETIC:/home/xetic/superkaramba-0.39#
    
    Hier die config.log
    Code:
    | #ifdef __cplusplus
    | extern "C" void std::exit (int) throw (); using std::exit;
    | #endif
    | #define KDELIBSUFF ""
    | #define STDC_HEADERS 1
    | #define HAVE_SYS_TYPES_H 1
    | #define HAVE_SYS_STAT_H 1
    | #define HAVE_STDLIB_H 1
    | #define HAVE_STRING_H 1
    | #define HAVE_MEMORY_H 1
    | #define HAVE_STRINGS_H 1
    | #define HAVE_INTTYPES_H 1
    | #define HAVE_STDINT_H 1
    | #define HAVE_UNISTD_H 1
    | #define HAVE_DLFCN_H 1
    | #define HAVE_SGI_STL 1
    | /* end confdefs.h.  */
    | 
    | 
    | #include <string.h>
    | 
    | 
    | int
    | main ()
    | {
    | 
    |  char buf[20];
    |   buf[0]='\0';
    |   strlcat(buf, "KDE function test", sizeof(buf));
    | 
    | 
    |   ;
    |   return 0;
    | }
    configure:22298: result: no
    configure:22301: checking if strlcat needs custom prototype
    configure:22405: result: yes - in libkdefakes
    configure:22430: checking for strlcpy
    configure:22477: g++ -c -Wno-long-long -Wundef -ansi -D_XOPEN_SOURCE=500 -D_BSD_SOURCE -Wcast-align -Wconversion -Wchar-subscripts -Wall -W -Wpointer-arith -O2 -Wformat-security -Wmissing-format-attribute -Wno-non-virtual-dtor -fno-exceptions -fno-check-new -fno-common -pedantic-errors  conftest.cc >&5
    conftest.cc: In function `int main()':
    conftest.cc:37: error: `strlcpy' undeclared (first use this function)
    conftest.cc:37: error: (Each undeclared identifier is reported only once for 
       each function it appears in.)
    configure:22483: $? = 1
    configure: failed program was:
    | /* confdefs.h.  */
    | 
    | #define PACKAGE_NAME ""
    | #define PACKAGE_TARNAME ""
    | #define PACKAGE_VERSION ""
    | #define PACKAGE_STRING ""
    | #define PACKAGE_BUGREPORT ""
    | #define PACKAGE "superkaramba-0.39"
    | #define VERSION "3.5.2"
    | #ifdef __cplusplus
    | extern "C" void std::exit (int) throw (); using std::exit;
    | #endif
    | #define KDELIBSUFF ""
    | #define STDC_HEADERS 1
    | #define HAVE_SYS_TYPES_H 1
    | #define HAVE_SYS_STAT_H 1
    | #define HAVE_STDLIB_H 1
    | #define HAVE_STRING_H 1
    | #define HAVE_MEMORY_H 1
    | #define HAVE_STRINGS_H 1
    | #define HAVE_INTTYPES_H 1
    | #define HAVE_STDINT_H 1
    | #define HAVE_UNISTD_H 1
    | #define HAVE_DLFCN_H 1
    | #define HAVE_SGI_STL 1
    | /* end confdefs.h.  */
    | 
    | 
    | #include <string.h>
    | 
    | 
    | int
    | main ()
    | {
    | 
    |  char buf[20];
    |   strlcpy(buf, "KDE function test", sizeof(buf));
    | 
    | 
    |   ;
    |   return 0;
    | }
    configure:22518: result: no
    configure:22521: checking if strlcpy needs custom prototype
    configure:22624: result: yes - in libkdefakes
    configure:22648: checking for main in -lutil
    configure:22672: gcc -o conftest -std=iso9899:1990 -W -Wall -Wchar-subscripts -Wshadow -Wpointer-arith -Wmissing-prototypes -Wwrite-strings -D_XOPEN_SOURCE=500 -D_BSD_SOURCE -O2   -Wformat-security -Wmissing-format-attribute   conftest.c -lutil   >&5
    configure:22678: $? = 0
    configure:22682: test -z 
    			 || test ! -s conftest.err
    configure:22685: $? = 0
    configure:22688: test -s conftest
    configure:22691: $? = 0
    configure:22704: result: yes
    configure:22710: checking for main in -lcompat
    configure:22734: gcc -o conftest -std=iso9899:1990 -W -Wall -Wchar-subscripts -Wshadow -Wpointer-arith -Wmissing-prototypes -Wwrite-strings -D_XOPEN_SOURCE=500 -D_BSD_SOURCE -O2   -Wformat-security -Wmissing-format-attribute   conftest.c -lcompat   >&5
    /usr/bin/ld: cannot find -lcompat
    collect2: ld returned 1 exit status
    configure:22740: $? = 1
    configure: failed program was:
    | /* confdefs.h.  */
    | 
    | #define PACKAGE_NAME ""
    | #define PACKAGE_TARNAME ""
    | #define PACKAGE_VERSION ""
    | #define PACKAGE_STRING ""
    | #define PACKAGE_BUGREPORT ""
    | #define PACKAGE "superkaramba-0.39"
    | #define VERSION "3.5.2"
    | #ifdef __cplusplus
    | extern "C" void std::exit (int) throw (); using std::exit;
    | #endif
    | #define KDELIBSUFF ""
    | #define STDC_HEADERS 1
    | #define HAVE_SYS_TYPES_H 1
    | #define HAVE_SYS_STAT_H 1
    | #define HAVE_STDLIB_H 1
    | #define HAVE_STRING_H 1
    | #define HAVE_MEMORY_H 1
    | #define HAVE_STRINGS_H 1
    | #define HAVE_INTTYPES_H 1
    | #define HAVE_STDINT_H 1
    | #define HAVE_UNISTD_H 1
    | #define HAVE_DLFCN_H 1
    | #define HAVE_SGI_STL 1
    | /* end confdefs.h.  */
    | 
    | 
    | int
    | main ()
    | {
    | main ();
    |   ;
    |   return 0;
    | }
    configure:22766: result: no
    configure:22773: checking for crypt in -lcrypt
    configure:22803: gcc -o conftest -std=iso9899:1990 -W -Wall -Wchar-subscripts -Wshadow -Wpointer-arith -Wmissing-prototypes -Wwrite-strings -D_XOPEN_SOURCE=500 -D_BSD_SOURCE -O2   -Wformat-security -Wmissing-format-attribute   conftest.c -lcrypt   >&5
    configure:22809: $? = 0
    configure:22813: test -z 
    			 || test ! -s conftest.err
    configure:22816: $? = 0
    configure:22819: test -s conftest
    configure:22822: $? = 0
    configure:22835: result: yes
    configure:22929: checking for socklen_t
    configure:22964: g++ -c -Wno-long-long -Wundef -ansi -D_XOPEN_SOURCE=500 -D_BSD_SOURCE -Wcast-align -Wconversion -Wchar-subscripts -Wall -W -Wpointer-arith -O2 -Wformat-security -Wmissing-format-attribute -Wno-non-virtual-dtor -fno-exceptions -fno-check-new -fno-common  conftest.cc >&5
    configure:22970: $? = 0
    configure:22974: test -z 
    			 || test ! -s conftest.err
    configure:22977: $? = 0
    configure:22980: test -s conftest.o
    configure:22983: $? = 0
    configure:23004: result: yes
    configure:23098: checking for dnet_ntoa in -ldnet
    configure:23128: gcc -o conftest -std=iso9899:1990 -W -Wall -Wchar-subscripts -Wshadow -Wpointer-arith -Wmissing-prototypes -Wwrite-strings -D_XOPEN_SOURCE=500 -D_BSD_SOURCE -O2   -Wformat-security -Wmissing-format-attribute   conftest.c -ldnet   >&5
    /usr/bin/ld: cannot find -ldnet
    collect2: ld returned 1 exit status
    configure:23134: $? = 1
    configure: failed program was:
    | /* confdefs.h.  */
    | 
    | #define PACKAGE_NAME ""
    | #define PACKAGE_TARNAME ""
    | #define PACKAGE_VERSION ""
    | #define PACKAGE_STRING ""
    | #define PACKAGE_BUGREPORT ""
    | #define PACKAGE "superkaramba-0.39"
    | #define VERSION "3.5.2"
    | #ifdef __cplusplus
    | extern "C" void std::exit (int) throw (); using std::exit;
    | #endif
    | #define KDELIBSUFF ""
    | #define STDC_HEADERS 1
    | #define HAVE_SYS_TYPES_H 1
    | #define HAVE_SYS_STAT_H 1
    | #define HAVE_STDLIB_H 1
    | #define HAVE_STRING_H 1
    | #define HAVE_MEMORY_H 1
    | #define HAVE_STRINGS_H 1
    | #define HAVE_INTTYPES_H 1
    | #define HAVE_STDINT_H 1
    | #define HAVE_UNISTD_H 1
    | #define HAVE_DLFCN_H 1
    | #define HAVE_SGI_STL 1
    | #define HAVE_CRYPT 1
    | #define kde_socklen_t socklen_t
    | #define ksize_t socklen_t
    | /* end confdefs.h.  */
    | 
    | /* Override any gcc2 internal prototype to avoid an error.  */
    | #ifdef __cplusplus
    | extern "C"
    | #endif
    | /* We use char because int might match the return type of a gcc2
    |    builtin and then its argument prototype would still apply.  */
    | char dnet_ntoa ();
    | int
    | main ()
    | {
    | dnet_ntoa ();
    |   ;
    |   return 0;
    | }
    configure:23160: result: no
    configure:23167: checking for dnet_ntoa in -ldnet_stub
    configure:23197: gcc -o conftest -std=iso9899:1990 -W -Wall -Wchar-subscripts -Wshadow -Wpointer-arith -Wmissing-prototypes -Wwrite-strings -D_XOPEN_SOURCE=500 -D_BSD_SOURCE -O2   -Wformat-security -Wmissing-format-attribute   conftest.c -ldnet_stub   >&5
    /usr/bin/ld: cannot find -ldnet_stub
    collect2: ld returned 1 exit status
    configure:23203: $? = 1
    configure: failed program was:
    | /* confdefs.h.  */
    | 
    | #define PACKAGE_NAME ""
    | #define PACKAGE_TARNAME ""
    | #define PACKAGE_VERSION ""
    | #define PACKAGE_STRING ""
    | #define PACKAGE_BUGREPORT ""
    | #define PACKAGE "superkaramba-0.39"
    | #define VERSION "3.5.2"
    | #ifdef __cplusplus
    | extern "C" void std::exit (int) throw (); using std::exit;
    | #endif
    | #define KDELIBSUFF ""
    | #define STDC_HEADERS 1
    | #define HAVE_SYS_TYPES_H 1
    | #define HAVE_SYS_STAT_H 1
    | #define HAVE_STDLIB_H 1
    | #define HAVE_STRING_H 1
    | #define HAVE_MEMORY_H 1
    | #define HAVE_STRINGS_H 1
    | #define HAVE_INTTYPES_H 1
    | #define HAVE_STDINT_H 1
    | #define HAVE_UNISTD_H 1
    | #define HAVE_DLFCN_H 1
    | #define HAVE_SGI_STL 1
    | #define HAVE_CRYPT 1
    | #define kde_socklen_t socklen_t
    | #define ksize_t socklen_t
    | /* end confdefs.h.  */
    | 
    | /* Override any gcc2 internal prototype to avoid an error.  */
    | #ifdef __cplusplus
    | extern "C"
    | #endif
    | /* We use char because int might match the return type of a gcc2
    |    builtin and then its argument prototype would still apply.  */
    | char dnet_ntoa ();
    | int
    | main ()
    | {
    | dnet_ntoa ();
    |   ;
    |   return 0;
    | }
    configure:23229: result: no
    configure:23236: checking for inet_ntoa
    configure:23293: gcc -o conftest -std=iso9899:1990 -W -Wall -Wchar-subscripts -Wshadow -Wpointer-arith -Wmissing-prototypes -Wwrite-strings -D_XOPEN_SOURCE=500 -D_BSD_SOURCE -O2   -Wformat-security -Wmissing-format-attribute   conftest.c  >&5
    configure:23299: $? = 0
    configure:23303: test -z 
    			 || test ! -s conftest.err
    configure:23306: $? = 0
    configure:23309: test -s conftest
    configure:23312: $? = 0
    configure:23324: result: yes
    configure:23397: checking for connect
    configure:23454: gcc -o conftest -std=iso9899:1990 -W -Wall -Wchar-subscripts -Wshadow -Wpointer-arith -Wmissing-prototypes -Wwrite-strings -D_XOPEN_SOURCE=500 -D_BSD_SOURCE -O2   -Wformat-security -Wmissing-format-attribute   conftest.c  >&5
    configure:23460: $? = 0
    configure:23464: test -z 
    			 || test ! -s conftest.err
    configure:23467: $? = 0
    configure:23470: test -s conftest
    configure:23473: $? = 0
    configure:23485: result: yes
    configure:23559: checking for remove
    configure:23616: gcc -o conftest -std=iso9899:1990 -W -Wall -Wchar-subscripts -Wshadow -Wpointer-arith -Wmissing-prototypes -Wwrite-strings -D_XOPEN_SOURCE=500 -D_BSD_SOURCE -O2   -Wformat-security -Wmissing-format-attribute   conftest.c  >&5
    configure:23622: $? = 0
    configure:23626: test -z 
    			 || test ! -s conftest.err
    configure:23629: $? = 0
    configure:23632: test -s conftest
    configure:23635: $? = 0
    configure:23647: result: yes
    configure:23722: checking for shmat
    configure:23779: gcc -o conftest -std=iso9899:1990 -W -Wall -Wchar-subscripts -Wshadow -Wpointer-arith -Wmissing-prototypes -Wwrite-strings -D_XOPEN_SOURCE=500 -D_BSD_SOURCE -O2   -Wformat-security -Wmissing-format-attribute   conftest.c  >&5
    configure:23785: $? = 0
    configure:23789: test -z 
    			 || test ! -s conftest.err
    configure:23792: $? = 0
    configure:23795: test -s conftest
    configure:23798: $? = 0
    configure:23810: result: yes
    configure:23893: checking for sys/types.h
    configure:23898: result: yes
    configure:23893: checking for stdint.h
    configure:23898: result: yes
    configure:24054: checking sys/bitypes.h usability
    configure:24066: gcc -c -std=iso9899:1990 -W -Wall -Wchar-subscripts -Wshadow -Wpointer-arith -Wmissing-prototypes -Wwrite-strings -D_XOPEN_SOURCE=500 -D_BSD_SOURCE -O2   -Wformat-security -Wmissing-format-attribute  conftest.c >&5
    configure:24072: $? = 0
    configure:24076: test -z 
    			 || test ! -s conftest.err
    configure:24079: $? = 0
    configure:24082: test -s conftest.o
    configure:24085: $? = 0
    configure:24095: result: yes
    configure:24099: checking sys/bitypes.h presence
    configure:24109: gcc -E  conftest.c
    configure:24115: $? = 0
    configure:24135: result: yes
    configure:24170: checking for sys/bitypes.h
    configure:24177: result: yes
    configure:24192: checking for poll in -lpoll
    configure:24222: gcc -o conftest -std=iso9899:1990 -W -Wall -Wchar-subscripts -Wshadow -Wpointer-arith -Wmissing-prototypes -Wwrite-strings -D_XOPEN_SOURCE=500 -D_BSD_SOURCE -O2   -Wformat-security -Wmissing-format-attribute   conftest.c -lpoll   >&5
    /usr/bin/ld: cannot find -lpoll
    collect2: ld returned 1 exit status
    configure:24228: $? = 1
    configure: failed program was:
    | /* confdefs.h.  */
    | 
    | #define PACKAGE_NAME ""
    | #define PACKAGE_TARNAME ""
    | #define PACKAGE_VERSION ""
    | #define PACKAGE_STRING ""
    | #define PACKAGE_BUGREPORT ""
    | #define PACKAGE "superkaramba-0.39"
    | #define VERSION "3.5.2"
    | #ifdef __cplusplus
    | extern "C" void std::exit (int) throw (); using std::exit;
    | #endif
    | #define KDELIBSUFF ""
    | #define STDC_HEADERS 1
    | #define HAVE_SYS_TYPES_H 1
    | #define HAVE_SYS_STAT_H 1
    | #define HAVE_STDLIB_H 1
    | #define HAVE_STRING_H 1
    | #define HAVE_MEMORY_H 1
    | #define HAVE_STRINGS_H 1
    | #define HAVE_INTTYPES_H 1
    | #define HAVE_STDINT_H 1
    | #define HAVE_UNISTD_H 1
    | #define HAVE_DLFCN_H 1
    | #define HAVE_SGI_STL 1
    | #define HAVE_CRYPT 1
    | #define kde_socklen_t socklen_t
    | #define ksize_t socklen_t
    | #define HAVE_SYS_TYPES_H 1
    | #define HAVE_STDINT_H 1
    | #define HAVE_SYS_BITYPES_H 1
    | /* end confdefs.h.  */
    | 
    | /* Override any gcc2 internal prototype to avoid an error.  */
    | #ifdef __cplusplus
    | extern "C"
    | #endif
    | /* We use char because int might match the return type of a gcc2
    |    builtin and then its argument prototype would still apply.  */
    | char poll ();
    | int
    | main ()
    | {
    | poll ();
    |   ;
    |   return 0;
    | }
    configure:24254: result: no
    configure:24276: checking Carbon/Carbon.h usability
    configure:24288: gcc -c -std=iso9899:1990 -W -Wall -Wchar-subscripts -Wshadow -Wpointer-arith -Wmissing-prototypes -Wwrite-strings -D_XOPEN_SOURCE=500 -D_BSD_SOURCE -O2   -Wformat-security -Wmissing-format-attribute  conftest.c >&5
    conftest.c:67:27: Carbon/Carbon.h: No such file or directory
    configure:24294: $? = 1
    configure: failed program was:
    | /* confdefs.h.  */
    | 
    | #define PACKAGE_NAME ""
    | #define PACKAGE_TARNAME ""
    | #define PACKAGE_VERSION ""
    | #define PACKAGE_STRING ""
    | #define PACKAGE_BUGREPORT ""
    | #define PACKAGE "superkaramba-0.39"
    | #define VERSION "3.5.2"
    | #ifdef __cplusplus
    | extern "C" void std::exit (int) throw (); using std::exit;
    | #endif
    | #define KDELIBSUFF ""
    | #define STDC_HEADERS 1
    | #define HAVE_SYS_TYPES_H 1
    | #define HAVE_SYS_STAT_H 1
    | #define HAVE_STDLIB_H 1
    | #define HAVE_STRING_H 1
    | #define HAVE_MEMORY_H 1
    | #define HAVE_STRINGS_H 1
    | #define HAVE_INTTYPES_H 1
    | #define HAVE_STDINT_H 1
    | #define HAVE_UNISTD_H 1
    | #define HAVE_DLFCN_H 1
    | #define HAVE_SGI_STL 1
    | #define HAVE_CRYPT 1
    | #define kde_socklen_t socklen_t
    | #define ksize_t socklen_t
    | #define HAVE_SYS_TYPES_H 1
    | #define HAVE_STDINT_H 1
    | #define HAVE_SYS_BITYPES_H 1
    | /* end confdefs.h.  */
    | #include <stdio.h>
    | #if HAVE_SYS_TYPES_H
    | # include <sys/types.h>
    | #endif
    | #if HAVE_SYS_STAT_H
    | # include <sys/stat.h>
    | #endif
    | #if STDC_HEADERS
    | # include <stdlib.h>
    | # include <stddef.h>
    | #else
    | # if HAVE_STDLIB_H
    | #  include <stdlib.h>
    | # endif
    | #endif
    | #if HAVE_STRING_H
    | # if !STDC_HEADERS && HAVE_MEMORY_H
    | #  include <memory.h>
    | # endif
    | # include <string.h>
    | #endif
    | #if HAVE_STRINGS_H
    | # include <strings.h>
    | #endif
    | #if HAVE_INTTYPES_H
    | # include <inttypes.h>
    | #else
    | # if HAVE_STDINT_H
    | #  include <stdint.h>
    | # endif
    | #endif
    | #if HAVE_UNISTD_H
    | # include <unistd.h>
    | #endif
    | #include <Carbon/Carbon.h>
    configure:24317: result: no
    configure:24321: checking Carbon/Carbon.h presence
    configure:24331: gcc -E  conftest.c
    conftest.c:33:27: Carbon/Carbon.h: No such file or directory
    configure:24337: $? = 1
    configure: failed program was:
    | /* confdefs.h.  */
    | 
    | #define PACKAGE_NAME ""
    | #define PACKAGE_TARNAME ""
    | #define PACKAGE_VERSION ""
    | #define PACKAGE_STRING ""
    | #define PACKAGE_BUGREPORT ""
    | #define PACKAGE "superkaramba-0.39"
    | #define VERSION "3.5.2"
    | #ifdef __cplusplus
    | extern "C" void std::exit (int) throw (); using std::exit;
    | #endif
    | #define KDELIBSUFF ""
    | #define STDC_HEADERS 1
    | #define HAVE_SYS_TYPES_H 1
    | #define HAVE_SYS_STAT_H 1
    | #define HAVE_STDLIB_H 1
    | #define HAVE_STRING_H 1
    | #define HAVE_MEMORY_H 1
    | #define HAVE_STRINGS_H 1
    | #define HAVE_INTTYPES_H 1
    | #define HAVE_STDINT_H 1
    | #define HAVE_UNISTD_H 1
    | #define HAVE_DLFCN_H 1
    | #define HAVE_SGI_STL 1
    | #define HAVE_CRYPT 1
    | #define kde_socklen_t socklen_t
    | #define ksize_t socklen_t
    | #define HAVE_SYS_TYPES_H 1
    | #define HAVE_STDINT_H 1
    | #define HAVE_SYS_BITYPES_H 1
    | /* end confdefs.h.  */
    | #include <Carbon/Carbon.h>
    configure:24357: result: no
    configure:24392: checking for Carbon/Carbon.h
    configure:24399: result: no
    configure:24424: checking CoreAudio/CoreAudio.h usability
    configure:24436: gcc -c -std=iso9899:1990 -W -Wall -Wchar-subscripts -Wshadow -Wpointer-arith -Wmissing-prototypes -Wwrite-strings -D_XOPEN_SOURCE=500 -D_BSD_SOURCE -O2   -Wformat-security -Wmissing-format-attribute  conftest.c >&5
    conftest.c:67:33: CoreAudio/CoreAudio.h: No such file or directory
    configure:24442: $? = 1
    configure: failed program was:
    | /* confdefs.h.  */
    | 
    | #define PACKAGE_NAME ""
    | #define PACKAGE_TARNAME ""
    | #define PACKAGE_VERSION ""
    | #define PACKAGE_STRING ""
    | #define PACKAGE_BUGREPORT ""
    | #define PACKAGE "superkaramba-0.39"
    | #define VERSION "3.5.2"
    | #ifdef __cplusplus
    | extern "C" void std::exit (int) throw (); using std::exit;
    | #endif
    | #define KDELIBSUFF ""
    | #define STDC_HEADERS 1
    | #define HAVE_SYS_TYPES_H 1
    | #define HAVE_SYS_STAT_H 1
    | #define HAVE_STDLIB_H 1
    | #define HAVE_STRING_H 1
    | #define HAVE_MEMORY_H 1
    | #define HAVE_STRINGS_H 1
    | #define HAVE_INTTYPES_H 1
    | #define HAVE_STDINT_H 1
    | #define HAVE_UNISTD_H 1
    | #define HAVE_DLFCN_H 1
    | #define HAVE_SGI_STL 1
    | #define HAVE_CRYPT 1
    | #define kde_socklen_t socklen_t
    | #define ksize_t socklen_t
    | #define HAVE_SYS_TYPES_H 1
    | #define HAVE_STDINT_H 1
    | #define HAVE_SYS_BITYPES_H 1
    | /* end confdefs.h.  */
    | #include <stdio.h>
    | #if HAVE_SYS_TYPES_H
    | # include <sys/types.h>
    | #endif
    | #if HAVE_SYS_STAT_H
    | # include <sys/stat.h>
    | #endif
    | #if STDC_HEADERS
    | # include <stdlib.h>
    | # include <stddef.h>
    | #else
    | # if HAVE_STDLIB_H
    | #  include <stdlib.h>
    | # endif
    | #endif
    | #if HAVE_STRING_H
    | # if !STDC_HEADERS && HAVE_MEMORY_H
    | #  include <memory.h>
    | # endif
    | # include <string.h>
    | #endif
    | #if HAVE_STRINGS_H
    | # include <strings.h>
    | #endif
    | #if HAVE_INTTYPES_H
    | # include <inttypes.h>
    | #else
    | # if HAVE_STDINT_H
    | #  include <stdint.h>
    | # endif
    | #endif
    | #if HAVE_UNISTD_H
    | # include <unistd.h>
    | #endif
    | #include <CoreAudio/CoreAudio.h>
    configure:24465: result: no
    configure:24469: checking CoreAudio/CoreAudio.h presence
    configure:24479: gcc -E  conftest.c
    conftest.c:33:33: CoreAudio/CoreAudio.h: No such file or directory
    configure:24485: $? = 1
    configure: failed program was:
    | /* confdefs.h.  */
    | 
    | #define PACKAGE_NAME ""
    | #define PACKAGE_TARNAME ""
    | #define PACKAGE_VERSION ""
    | #define PACKAGE_STRING ""
    | #define PACKAGE_BUGREPORT ""
    | #define PACKAGE "superkaramba-0.39"
    | #define VERSION "3.5.2"
    | #ifdef __cplusplus
    | extern "C" void std::exit (int) throw (); using std::exit;
    | #endif
    | #define KDELIBSUFF ""
    | #define STDC_HEADERS 1
    | #define HAVE_SYS_TYPES_H 1
    | #define HAVE_SYS_STAT_H 1
    | #define HAVE_STDLIB_H 1
    | #define HAVE_STRING_H 1
    | #define HAVE_MEMORY_H 1
    | #define HAVE_STRINGS_H 1
    | #define HAVE_INTTYPES_H 1
    | #define HAVE_STDINT_H 1
    | #define HAVE_UNISTD_H 1
    | #define HAVE_DLFCN_H 1
    | #define HAVE_SGI_STL 1
    | #define HAVE_CRYPT 1
    | #define kde_socklen_t socklen_t
    | #define ksize_t socklen_t
    | #define HAVE_SYS_TYPES_H 1
    | #define HAVE_STDINT_H 1
    | #define HAVE_SYS_BITYPES_H 1
    | /* end confdefs.h.  */
    | #include <CoreAudio/CoreAudio.h>
    configure:24505: result: no
    configure:24540: checking for CoreAudio/CoreAudio.h
    configure:24547: result: no
    configure:24565: checking if res_init needs -lresolv
    configure:24592: gcc -o conftest -std=iso9899:1990 -W -Wall -Wchar-subscripts -Wshadow -Wpointer-arith -Wmissing-prototypes -Wwrite-strings -D_XOPEN_SOURCE=500 -D_BSD_SOURCE -O2   -Wformat-security -Wmissing-format-attribute   conftest.c   -lresolv >&5
    configure:24598: $? = 0
    configure:24602: test -z 
    			 || test ! -s conftest.err
    configure:24605: $? = 0
    configure:24608: test -s conftest
    configure:24611: $? = 0
    configure:24615: result: yes
    configure:24637: checking for res_init
    configure:24685: g++ -c -Wno-long-long -Wundef -ansi -D_XOPEN_SOURCE=500 -D_BSD_SOURCE -Wcast-align -Wconversion -Wchar-subscripts -Wall -W -Wpointer-arith -O2 -Wformat-security -Wmissing-format-attribute -Wno-non-virtual-dtor -fno-exceptions -fno-check-new -fno-common -pedantic-errors  conftest.cc >&5
    configure:24691: $? = 0
    configure:24695: test -z 
    			 || test ! -s conftest.err
    configure:24698: $? = 0
    configure:24701: test -s conftest.o
    configure:24704: $? = 0
    configure:24726: result: yes
    configure:24729: checking if res_init needs custom prototype
    configure:24833: result: no
    configure:24861: checking for killpg in -lucb
    configure:24891: gcc -o conftest -std=iso9899:1990 -W -Wall -Wchar-subscripts -Wshadow -Wpointer-arith -Wmissing-prototypes -Wwrite-strings -D_XOPEN_SOURCE=500 -D_BSD_SOURCE -O2   -Wformat-security -Wmissing-format-attribute   conftest.c -lucb   >&5
    /usr/bin/ld: cannot find -lucb
    collect2: ld returned 1 exit status
    configure:24897: $? = 1
    configure: failed program was:
    | /* confdefs.h.  */
    | 
    | #define PACKAGE_NAME ""
    | #define PACKAGE_TARNAME ""
    | #define PACKAGE_VERSION ""
    | #define PACKAGE_STRING ""
    | #define PACKAGE_BUGREPORT ""
    | #define PACKAGE "superkaramba-0.39"
    | #define VERSION "3.5.2"
    | #ifdef __cplusplus
    | extern "C" void std::exit (int) throw (); using std::exit;
    | #endif
    | #define KDELIBSUFF ""
    | #define STDC_HEADERS 1
    | #define HAVE_SYS_TYPES_H 1
    | #define HAVE_SYS_STAT_H 1
    | #define HAVE_STDLIB_H 1
    | #define HAVE_STRING_H 1
    | #define HAVE_MEMORY_H 1
    | #define HAVE_STRINGS_H 1
    | #define HAVE_INTTYPES_H 1
    | #define HAVE_STDINT_H 1
    | #define HAVE_UNISTD_H 1
    | #define HAVE_DLFCN_H 1
    | #define HAVE_SGI_STL 1
    | #define HAVE_CRYPT 1
    | #define kde_socklen_t socklen_t
    | #define ksize_t socklen_t
    | #define HAVE_SYS_TYPES_H 1
    | #define HAVE_STDINT_H 1
    | #define HAVE_SYS_BITYPES_H 1
    | #define HAVE_RES_INIT 1
    | #define HAVE_RES_INIT 1
    | #define HAVE_RES_INIT_PROTO 1
    | /* end confdefs.h.  */
    | 
    | /* Override any gcc2 internal prototype to avoid an error.  */
    | #ifdef __cplusplus
    | extern "C"
    | #endif
    | /* We use char because int might match the return type of a gcc2
    |    builtin and then its argument prototype would still apply.  */
    | char killpg ();
    | int
    | main ()
    | {
    | killpg ();
    |   ;
    |   return 0;
    | }
    configure:24923: result: no
    configure:25006: checking for int
    configure:25030: gcc -c -std=iso9899:1990 -W -Wall -Wchar-subscripts -Wshadow -Wpointer-arith -Wmissing-prototypes -Wwrite-strings -D_XOPEN_SOURCE=500 -D_BSD_SOURCE -O2   -Wformat-security -Wmissing-format-attribute  conftest.c >&5
    configure:25036: $? = 0
    configure:25040: test -z 
    			 || test ! -s conftest.err
    configure:25043: $? = 0
    configure:25046: test -s conftest.o
    configure:25049: $? = 0
    configure:25060: result: yes
    configure:25063: checking size of int
    configure:25382: gcc -o conftest -std=iso9899:1990 -W -Wall -Wchar-subscripts -Wshadow -Wpointer-arith -Wmissing-prototypes -Wwrite-strings -D_XOPEN_SOURCE=500 -D_BSD_SOURCE -O2   -Wformat-security -Wmissing-format-attribute   conftest.c  >&5
    conftest.c:70: warning: no previous prototype for `longval'
    conftest.c:71: warning: no previous prototype for `ulongval'
    configure:25385: $? = 0
    configure:25387: ./conftest
    configure:25390: $? = 0
    configure:25413: result: 4
    configure:25419: checking for short
    configure:25443: gcc -c -std=iso9899:1990 -W -Wall -Wchar-subscripts -Wshadow -Wpointer-arith -Wmissing-prototypes -Wwrite-strings -D_XOPEN_SOURCE=500 -D_BSD_SOURCE -O2   -Wformat-security -Wmissing-format-attribute  conftest.c >&5
    configure:25449: $? = 0
    configure:25453: test -z 
    			 || test ! -s conftest.err
    configure:25456: $? = 0
    configure:25459: test -s conftest.o
    configure:25462: $? = 0
    configure:25473: result: yes
    configure:25476: checking size of short
    configure:25795: gcc -o conftest -std=iso9899:1990 -W -Wall -Wchar-subscripts -Wshadow -Wpointer-arith -Wmissing-prototypes -Wwrite-strings -D_XOPEN_SOURCE=500 -D_BSD_SOURCE -O2   -Wformat-security -Wmissing-format-attribute   conftest.c  >&5
    conftest.c:71: warning: no previous prototype for `longval'
    conftest.c:72: warning: no previous prototype for `ulongval'
    configure:25798: $? = 0
    configure:25800: ./conftest
    configure:25803: $? = 0
    configure:25826: result: 2
    configure:25832: checking for long
    configure:25856: gcc -c -std=iso9899:1990 -W -Wall -Wchar-subscripts -Wshadow -Wpointer-arith -Wmissing-prototypes -Wwrite-strings -D_XOPEN_SOURCE=500 -D_BSD_SOURCE -O2   -Wformat-security -Wmissing-format-attribute  conftest.c >&5
    configure:25862: $? = 0
    configure:25866: test -z 
    			 || test ! -s conftest.err
    configure:25869: $? = 0
    configure:25872: test -s conftest.o
    configure:25875: $? = 0
    configure:25886: result: yes
    configure:25889: checking size of long
    configure:26208: gcc -o conftest -std=iso9899:1990 -W -Wall -Wchar-subscripts -Wshadow -Wpointer-arith -Wmissing-prototypes -Wwrite-strings -D_XOPEN_SOURCE=500 -D_BSD_SOURCE -O2   -Wformat-security -Wmissing-format-attribute   conftest.c  >&5
    conftest.c:72: warning: no previous prototype for `longval'
    conftest.c:73: warning: no previous prototype for `ulongval'
    configure:26211: $? = 0
    configure:26213: ./conftest
    configure:26216: $? = 0
    configure:26239: result: 4
    configure:26245: checking for char *
    configure:26269: gcc -c -std=iso9899:1990 -W -Wall -Wchar-subscripts -Wshadow -Wpointer-arith -Wmissing-prototypes -Wwrite-strings -D_XOPEN_SOURCE=500 -D_BSD_SOURCE -O2   -Wformat-security -Wmissing-format-attribute  conftest.c >&5
    configure:26275: $? = 0
    configure:26279: test -z 
    			 || test ! -s conftest.err
    configure:26282: $? = 0
    configure:26285: test -s conftest.o
    configure:26288: $? = 0
    configure:26299: result: yes
    configure:26302: checking size of char *
    configure:26621: gcc -o conftest -std=iso9899:1990 -W -Wall -Wchar-subscripts -Wshadow -Wpointer-arith -Wmissing-prototypes -Wwrite-strings -D_XOPEN_SOURCE=500 -D_BSD_SOURCE -O2   -Wformat-security -Wmissing-format-attribute   conftest.c  >&5
    conftest.c:73: warning: no previous prototype for `longval'
    conftest.c:74: warning: no previous prototype for `ulongval'
    configure:26624: $? = 0
    configure:26626: ./conftest
    configure:26629: $? = 0
    configure:26652: result: 4
    configure:26660: checking for dlopen in -ldl
    configure:26722: result: yes
    configure:26732: checking for shl_unload in -ldld
    configure:26762: gcc -o conftest -std=iso9899:1990 -W -Wall -Wchar-subscripts -Wshadow -Wpointer-arith -Wmissing-prototypes -Wwrite-strings -D_XOPEN_SOURCE=500 -D_BSD_SOURCE -O2   -Wformat-security -Wmissing-format-attribute   conftest.c -ldld   >&5
    /usr/bin/ld: cannot find -ldld
    collect2: ld returned 1 exit status
    configure:26768: $? = 1
    configure: failed program was:
    | /* confdefs.h.  */
    | 
    | #define PACKAGE_NAME ""
    | #define PACKAGE_TARNAME ""
    | #define PACKAGE_VERSION ""
    | #define PACKAGE_STRING ""
    | #define PACKAGE_BUGREPORT ""
    | #define PACKAGE "superkaramba-0.39"
    | #define VERSION "3.5.2"
    | #ifdef __cplusplus
    | extern "C" void std::exit (int) throw (); using std::exit;
    | #endif
    | #define KDELIBSUFF ""
    | #define STDC_HEADERS 1
    | #define HAVE_SYS_TYPES_H 1
    | #define HAVE_SYS_STAT_H 1
    | #define HAVE_STDLIB_H 1
    | #define HAVE_STRING_H 1
    | #define HAVE_MEMORY_H 1
    | #define HAVE_STRINGS_H 1
    | #define HAVE_INTTYPES_H 1
    | #define HAVE_STDINT_H 1
    | #define HAVE_UNISTD_H 1
    | #define HAVE_DLFCN_H 1
    | #define HAVE_SGI_STL 1
    | #define HAVE_CRYPT 1
    | #define kde_socklen_t socklen_t
    | #define ksize_t socklen_t
    | #define HAVE_SYS_TYPES_H 1
    | #define HAVE_STDINT_H 1
    | #define HAVE_SYS_BITYPES_H 1
    | #define HAVE_RES_INIT 1
    | #define HAVE_RES_INIT 1
    | #define HAVE_RES_INIT_PROTO 1
    | #define SIZEOF_INT 4
    | #define SIZEOF_SHORT 2
    | #define SIZEOF_LONG 4
    | #define SIZEOF_CHAR_P 4
    | /* end confdefs.h.  */
    | 
    | /* Override any gcc2 internal prototype to avoid an error.  */
    | #ifdef __cplusplus
    | extern "C"
    | #endif
    | /* We use char because int might match the return type of a gcc2
    |    builtin and then its argument prototype would still apply.  */
    | char shl_unload ();
    | int
    | main ()
    | {
    | shl_unload ();
    |   ;
    |   return 0;
    | }
    configure:26794: result: no
    configure:26809: checking for size_t
    configure:26833: gcc -c -std=iso9899:1990 -W -Wall -Wchar-subscripts -Wshadow -Wpointer-arith -Wmissing-prototypes -Wwrite-strings -D_XOPEN_SOURCE=500 -D_BSD_SOURCE -O2   -Wformat-security -Wmissing-format-attribute  conftest.c >&5
    configure:26839: $? = 0
    configure:26843: test -z 
    			 || test ! -s conftest.err
    configure:26846: $? = 0
    configure:26849: test -s conftest.o
    configure:26852: $? = 0
    configure:26863: result: yes
    configure:26866: checking size of size_t
    configure:27185: gcc -o conftest -std=iso9899:1990 -W -Wall -Wchar-subscripts -Wshadow -Wpointer-arith -Wmissing-prototypes -Wwrite-strings -D_XOPEN_SOURCE=500 -D_BSD_SOURCE -O2   -Wformat-security -Wmissing-format-attribute   conftest.c  >&5
    conftest.c:74: warning: no previous prototype for `longval'
    conftest.c:75: warning: no previous prototype for `ulongval'
    configure:27188: $? = 0
    configure:27190: ./conftest
    configure:27193: $? = 0
    configure:27216: result: 4
    configure:27223: checking for unsigned long
    configure:27247: gcc -c -std=iso9899:1990 -W -Wall -Wchar-subscripts -Wshadow -Wpointer-arith -Wmissing-prototypes -Wwrite-strings -D_XOPEN_SOURCE=500 -D_BSD_SOURCE -O2   -Wformat-security -Wmissing-format-attribute  conftest.c >&5
    configure:27253: $? = 0
    configure:27257: test -z 
    			 || test ! -s conftest.err
    configure:27260: $? = 0
    configure:27263: test -s conftest.o
    configure:27266: $? = 0
    configure:27277: result: yes
    configure:27280: checking size of unsigned long
    configure:27599: gcc -o conftest -std=iso9899:1990 -W -Wall -Wchar-subscripts -Wshadow -Wpointer-arith -Wmissing-prototypes -Wwrite-strings -D_XOPEN_SOURCE=500 -D_BSD_SOURCE -O2   -Wformat-security -Wmissing-format-attribute   conftest.c  >&5
    conftest.c:75: warning: no previous prototype for `longval'
    conftest.c:76: warning: no previous prototype for `ulongval'
    configure:27602: $? = 0
    configure:27604: ./conftest
    configure:27607: $? = 0
    configure:27630: result: 4
    configure:27638: checking sizeof size_t == sizeof unsigned long
    configure:27660: gcc -c -std=iso9899:1990 -W -Wall -Wchar-subscripts -Wshadow -Wpointer-arith -Wmissing-prototypes -Wwrite-strings -D_XOPEN_SOURCE=500 -D_BSD_SOURCE -O2   -Wformat-security -Wmissing-format-attribute  conftest.c >&5
    configure:27666: $? = 0
    configure:27670: test -z 
    			 || test ! -s conftest.err
    configure:27673: $? = 0
    configure:27676: test -s conftest.o
    configure:27679: $? = 0
    configure:27681: result: yes
    configure:27704: checking for PIE support
    configure:27742: rm -rf SunWS_cache; g++ -o conftest -Wno-long-long -Wundef -ansi -D_XOPEN_SOURCE=500 -D_BSD_SOURCE -Wcast-align -Wconversion -Wchar-subscripts -Wall -W -Wpointer-arith -O2 -Wformat-security -Wmissing-format-attribute -Wno-non-virtual-dtor -fno-exceptions -fno-check-new -fno-common -fPIE   -pie conftest.cc  1>&5
    g++: unrecognized option `-pie'
    cc1plus: error: unrecognized option `-fPIE'
    configure:27748: $? = 1
    configure: failed program was:
    | /* confdefs.h.  */
    | 
    | #define PACKAGE_NAME ""
    | #define PACKAGE_TARNAME ""
    | #define PACKAGE_VERSION ""
    | #define PACKAGE_STRING ""
    | #define PACKAGE_BUGREPORT ""
    | #define PACKAGE "superkaramba-0.39"
    | #define VERSION "3.5.2"
    | #ifdef __cplusplus
    | extern "C" void std::exit (int) throw (); using std::exit;
    | #endif
    | #define KDELIBSUFF ""
    | #define STDC_HEADERS 1
    | #define HAVE_SYS_TYPES_H 1
    | #define HAVE_SYS_STAT_H 1
    | #define HAVE_STDLIB_H 1
    | #define HAVE_STRING_H 1
    | #define HAVE_MEMORY_H 1
    | #define HAVE_STRINGS_H 1
    | #define HAVE_INTTYPES_H 1
    | #define HAVE_STDINT_H 1
    | #define HAVE_UNISTD_H 1
    | #define HAVE_DLFCN_H 1
    | #define HAVE_SGI_STL 1
    | #define HAVE_CRYPT 1
    | #define kde_socklen_t socklen_t
    | #define ksize_t socklen_t
    | #define HAVE_SYS_TYPES_H 1
    | #define HAVE_STDINT_H 1
    | #define HAVE_SYS_BITYPES_H 1
    | #define HAVE_RES_INIT 1
    | #define HAVE_RES_INIT 1
    | #define HAVE_RES_INIT_PROTO 1
    | #define SIZEOF_INT 4
    | #define SIZEOF_SHORT 2
    | #define SIZEOF_LONG 4
    | #define SIZEOF_CHAR_P 4
    | #define SIZEOF_SIZE_T 4
    | #define SIZEOF_UNSIGNED_LONG 4
    | /* end confdefs.h.  */
    | int foo;
    | int
    | main ()
    | {
    | 
    |   ;
    |   return 0;
    | }
    configure:27783: result: no
    configure:27786: checking if enabling -pie/fPIE support
    configure:27801: result: no
    configure:27831: checking crt_externs.h usability
    configure:27843: gcc -c -std=iso9899:1990 -W -Wall -Wchar-subscripts -Wshadow -Wpointer-arith -Wmissing-prototypes -Wwrite-strings -D_XOPEN_SOURCE=500 -D_BSD_SOURCE -O2   -Wformat-security -Wmissing-format-attribute  conftest.c >&5
    conftest.c:76:25: crt_externs.h: No such file or directory
    configure:27849: $? = 1
    configure: failed program was:
    | /* confdefs.h.  */
    | 
    | #define PACKAGE_NAME ""
    | #define PACKAGE_TARNAME ""
    | #define PACKAGE_VERSION ""
    | #define PACKAGE_STRING ""
    | #define PACKAGE_BUGREPORT ""
    | #define PACKAGE "superkaramba-0.39"
    | #define VERSION "3.5.2"
    | #ifdef __cplusplus
    | extern "C" void std::exit (int) throw (); using std::exit;
    | #endif
    | #define KDELIBSUFF ""
    | #define STDC_HEADERS 1
    | #define HAVE_SYS_TYPES_H 1
    | #define HAVE_SYS_STAT_H 1
    | #define HAVE_STDLIB_H 1
    | #define HAVE_STRING_H 1
    | #define HAVE_MEMORY_H 1
    | #define HAVE_STRINGS_H 1
    | #define HAVE_INTTYPES_H 1
    | #define HAVE_STDINT_H 1
    | #define HAVE_UNISTD_H 1
    | #define HAVE_DLFCN_H 1
    | #define HAVE_SGI_STL 1
    | #define HAVE_CRYPT 1
    | #define kde_socklen_t socklen_t
    | #define ksize_t socklen_t
    | #define HAVE_SYS_TYPES_H 1
    | #define HAVE_STDINT_H 1
    | #define HAVE_SYS_BITYPES_H 1
    | #define HAVE_RES_INIT 1
    | #define HAVE_RES_INIT 1
    | #define HAVE_RES_INIT_PROTO 1
    | #define SIZEOF_INT 4
    | #define SIZEOF_SHORT 2
    | #define SIZEOF_LONG 4
    | #define SIZEOF_CHAR_P 4
    | #define SIZEOF_SIZE_T 4
    | #define SIZEOF_UNSIGNED_LONG 4
    | /* end confdefs.h.  */
    | #include <stdio.h>
    | #if HAVE_SYS_TYPES_H
    | # include <sys/types.h>
    | #endif
    | #if HAVE_SYS_STAT_H
    | # include <sys/stat.h>
    | #endif
    | #if STDC_HEADERS
    | # include <stdlib.h>
    | # include <stddef.h>
    | #else
    | # if HAVE_STDLIB_H
    | #  include <stdlib.h>
    | # endif
    | #endif
    | #if HAVE_STRING_H
    | # if !STDC_HEADERS && HAVE_MEMORY_H
    | #  include <memory.h>
    | # endif
    | # include <string.h>
    | #endif
    | #if HAVE_STRINGS_H
    | # include <strings.h>
    | #endif
    | #if HAVE_INTTYPES_H
    | # include <inttypes.h>
    | #else
    | # if HAVE_STDINT_H
    | #  include <stdint.h>
    | # endif
    | #endif
    | #if HAVE_UNISTD_H
    | # include <unistd.h>
    | #endif
    | #include <crt_externs.h>
    configure:27872: result: no
    configure:27876: checking crt_externs.h presence
    configure:27886: gcc -E  conftest.c
    conftest.c:42:25: crt_externs.h: No such file or directory
    configure:27892: $? = 1
    configure: failed program was:
    | /* confdefs.h.  */
    | 
    | #define PACKAGE_NAME ""
    | #define PACKAGE_TARNAME ""
    | #define PACKAGE_VERSION ""
    | #define PACKAGE_STRING ""
    | #define PACKAGE_BUGREPORT ""
    | #define PACKAGE "superkaramba-0.39"
    | #define VERSION "3.5.2"
    | #ifdef __cplusplus
    | extern "C" void std::exit (int) throw (); using std::exit;
    | #endif
    | #define KDELIBSUFF ""
    | #define STDC_HEADERS 1
    | #define HAVE_SYS_TYPES_H 1
    | #define HAVE_SYS_STAT_H 1
    | #define HAVE_STDLIB_H 1
    | #define HAVE_STRING_H 1
    | #define HAVE_MEMORY_H 1
    | #define HAVE_STRINGS_H 1
    | #define HAVE_INTTYPES_H 1
    | #define HAVE_STDINT_H 1
    | #define HAVE_UNISTD_H 1
    | #define HAVE_DLFCN_H 1
    | #define HAVE_SGI_STL 1
    | #define HAVE_CRYPT 1
    | #define kde_socklen_t socklen_t
    | #define ksize_t socklen_t
    | #define HAVE_SYS_TYPES_H 1
    | #define HAVE_STDINT_H 1
    | #define HAVE_SYS_BITYPES_H 1
    | #define HAVE_RES_INIT 1
    | #define HAVE_RES_INIT 1
    | #define HAVE_RES_INIT_PROTO 1
    | #define SIZEOF_INT 4
    | #define SIZEOF_SHORT 2
    | #define SIZEOF_LONG 4
    | #define SIZEOF_CHAR_P 4
    | #define SIZEOF_SIZE_T 4
    | #define SIZEOF_UNSIGNED_LONG 4
    | /* end confdefs.h.  */
    | #include <crt_externs.h>
    configure:27912: result: no
    configure:27947: checking for crt_externs.h
    configure:27954: result: no
    configure:27967: checking for _NSGetEnviron
    configure:28024: gcc -o conftest -std=iso9899:1990 -W -Wall -Wchar-subscripts -Wshadow -Wpointer-arith -Wmissing-prototypes -Wwrite-strings -D_XOPEN_SOURCE=500 -D_BSD_SOURCE -O2   -Wformat-security -Wmissing-format-attribute   conftest.c  >&5
    /tmp/ccIQhP66.o(.text+0x11): In function `main':
    : undefined reference to `_NSGetEnviron'
    /tmp/ccIQhP66.o(.data+0x0): undefined reference to `_NSGetEnviron'
    collect2: ld returned 1 exit status
    configure:28030: $? = 1
    configure: failed program was:
    | /* confdefs.h.  */
    | 
    | #define PACKAGE_NAME ""
    | #define PACKAGE_TARNAME ""
    | #define PACKAGE_VERSION ""
    | #define PACKAGE_STRING ""
    | #define PACKAGE_BUGREPORT ""
    | #define PACKAGE "superkaramba-0.39"
    | #define VERSION "3.5.2"
    | #ifdef __cplusplus
    | extern "C" void std::exit (int) throw (); using std::exit;
    | #endif
    | #define KDELIBSUFF ""
    | #define STDC_HEADERS 1
    | #define HAVE_SYS_TYPES_H 1
    | #define HAVE_SYS_STAT_H 1
    | #define HAVE_STDLIB_H 1
    | #define HAVE_STRING_H 1
    | #define HAVE_MEMORY_H 1
    | #define HAVE_STRINGS_H 1
    | #define HAVE_INTTYPES_H 1
    | #define HAVE_STDINT_H 1
    | #define HAVE_UNISTD_H 1
    | #define HAVE_DLFCN_H 1
    | #define HAVE_SGI_STL 1
    | #define HAVE_CRYPT 1
    | #define kde_socklen_t socklen_t
    | #define ksize_t socklen_t
    | #define HAVE_SYS_TYPES_H 1
    | #define HAVE_STDINT_H 1
    | #define HAVE_SYS_BITYPES_H 1
    | #define HAVE_RES_INIT 1
    | #define HAVE_RES_INIT 1
    | #define HAVE_RES_INIT_PROTO 1
    | #define SIZEOF_INT 4
    | #define SIZEOF_SHORT 2
    | #define SIZEOF_LONG 4
    | #define SIZEOF_CHAR_P 4
    | #define SIZEOF_SIZE_T 4
    | #define SIZEOF_UNSIGNED_LONG 4
    | /* end confdefs.h.  */
    | /* Define _NSGetEnviron to an innocuous variant, in case <limits.h> declares _NSGetEnviron.
    |    For example, HP-UX 11i <limits.h> declares gettimeofday.  */
    | #define _NSGetEnviron innocuous__NSGetEnviron
    | 
    | /* System header to define __stub macros and hopefully few prototypes,
    |     which can conflict with char _NSGetEnviron (); below.
    |     Prefer <limits.h> to <assert.h> if __STDC__ is defined, since
    |     <limits.h> exists even on freestanding compilers.  */
    | 
    | #ifdef __STDC__
    | # include <limits.h>
    | #else
    | # include <assert.h>
    | #endif
    | 
    | #undef _NSGetEnviron
    | 
    | /* Override any gcc2 internal prototype to avoid an error.  */
    | #ifdef __cplusplus
    | extern "C"
    | {
    | #endif
    | /* We use char because int might match the return type of a gcc2
    |    builtin and then its argument prototype would still apply.  */
    | char _NSGetEnviron ();
    | /* The GNU C library defines this for functions which it implements
    |     to always fail with ENOSYS.  Some functions are actually named
    |     something starting with __ and the normal name is an alias.  */
    | #if defined (__stub__NSGetEnviron) || defined (__stub____NSGetEnviron)
    | choke me
    | #else
    | char (*f) () = _NSGetEnviron;
    | #endif
    | #ifdef __cplusplus
    | }
    | #endif
    | 
    | int
    | main ()
    | {
    | return f != _NSGetEnviron;
    |   ;
    |   return 0;
    | }
    configure:28055: result: no
    configure:28077: checking for vsnprintf
    configure:28134: gcc -o conftest -std=iso9899:1990 -W -Wall -Wchar-subscripts -Wshadow -Wpointer-arith -Wmissing-prototypes -Wwrite-strings -D_XOPEN_SOURCE=500 -D_BSD_SOURCE -O2   -Wformat-security -Wmissing-format-attribute   conftest.c  >&5
    configure:28140: $? = 0
    configure:28144: test -z 
    			 || test ! -s conftest.err
    configure:28147: $? = 0
    configure:28150: test -s conftest
    configure:28153: $? = 0
    configure:28165: result: yes
    configure:28077: checking for snprintf
    configure:28134: gcc -o conftest -std=iso9899:1990 -W -Wall -Wchar-subscripts -Wshadow -Wpointer-arith -Wmissing-prototypes -Wwrite-strings -D_XOPEN_SOURCE=500 -D_BSD_SOURCE -O2   -Wformat-security -Wmissing-format-attribute   conftest.c  >&5
    configure:28140: $? = 0
    configure:28144: test -z 
    			 || test ! -s conftest.err
    configure:28147: $? = 0
    configure:28150: test -s conftest
    configure:28153: $? = 0
    configure:28165: result: yes
    configure:28224: checking for X
    configure:28262: gcc -E  conftest.c
    conftest.c:44:27: X11/Intrinsic.h: No such file or directory
    configure:28268: $? = 1
    configure: failed program was:
    | /* confdefs.h.  */
    | 
    | #define PACKAGE_NAME ""
    | #define PACKAGE_TARNAME ""
    | #define PACKAGE_VERSION ""
    | #define PACKAGE_STRING ""
    | #define PACKAGE_BUGREPORT ""
    | #define PACKAGE "superkaramba-0.39"
    | #define VERSION "3.5.2"
    | #ifdef __cplusplus
    | extern "C" void std::exit (int) throw (); using std::exit;
    | #endif
    | #define KDELIBSUFF ""
    | #define STDC_HEADERS 1
    | #define HAVE_SYS_TYPES_H 1
    | #define HAVE_SYS_STAT_H 1
    | #define HAVE_STDLIB_H 1
    | #define HAVE_STRING_H 1
    | #define HAVE_MEMORY_H 1
    | #define HAVE_STRINGS_H 1
    | #define HAVE_INTTYPES_H 1
    | #define HAVE_STDINT_H 1
    | #define HAVE_UNISTD_H 1
    | #define HAVE_DLFCN_H 1
    | #define HAVE_SGI_STL 1
    | #define HAVE_CRYPT 1
    | #define kde_socklen_t socklen_t
    | #define ksize_t socklen_t
    | #define HAVE_SYS_TYPES_H 1
    | #define HAVE_STDINT_H 1
    | #define HAVE_SYS_BITYPES_H 1
    | #define HAVE_RES_INIT 1
    | #define HAVE_RES_INIT 1
    | #define HAVE_RES_INIT_PROTO 1
    | #define SIZEOF_INT 4
    | #define SIZEOF_SHORT 2
    | #define SIZEOF_LONG 4
    | #define SIZEOF_CHAR_P 4
    | #define SIZEOF_SIZE_T 4
    | #define SIZEOF_UNSIGNED_LONG 4
    | #define HAVE_VSNPRINTF 1
    | #define HAVE_SNPRINTF 1
    | /* end confdefs.h.  */
    | #include <X11/Intrinsic.h>
    configure:28359: gcc -o conftest -std=iso9899:1990 -W -Wall -Wchar-subscripts -Wshadow -Wpointer-arith -Wmissing-prototypes -Wwrite-strings -D_XOPEN_SOURCE=500 -D_BSD_SOURCE -O2   -Wformat-security -Wmissing-format-attribute   conftest.c -lXt  >&5
    conftest.c:44:27: X11/Intrinsic.h: No such file or directory
    conftest.c: In function `main':
    conftest.c:48: warning: implicit declaration of function `XtMalloc'
    configure:28365: $? = 1
    configure: failed program was:
    | /* confdefs.h.  */
    | 
    | #define PACKAGE_NAME ""
    | #define PACKAGE_TARNAME ""
    | #define PACKAGE_VERSION ""
    | #define PACKAGE_STRING ""
    | #define PACKAGE_BUGREPORT ""
    | #define PACKAGE "superkaramba-0.39"
    | #define VERSION "3.5.2"
    | #ifdef __cplusplus
    | extern "C" void std::exit (int) throw (); using std::exit;
    | #endif
    | #define KDELIBSUFF ""
    | #define STDC_HEADERS 1
    | #define HAVE_SYS_TYPES_H 1
    | #define HAVE_SYS_STAT_H 1
    | #define HAVE_STDLIB_H 1
    | #define HAVE_STRING_H 1
    | #define HAVE_MEMORY_H 1
    | #define HAVE_STRINGS_H 1
    | #define HAVE_INTTYPES_H 1
    | #define HAVE_STDINT_H 1
    | #define HAVE_UNISTD_H 1
    | #define HAVE_DLFCN_H 1
    | #define HAVE_SGI_STL 1
    | #define HAVE_CRYPT 1
    | #define kde_socklen_t socklen_t
    | #define ksize_t socklen_t
    | #define HAVE_SYS_TYPES_H 1
    | #define HAVE_STDINT_H 1
    | #define HAVE_SYS_BITYPES_H 1
    | #define HAVE_RES_INIT 1
    | #define HAVE_RES_INIT 1
    | #define HAVE_RES_INIT_PROTO 1
    | #define SIZEOF_INT 4
    | #define SIZEOF_SHORT 2
    | #define SIZEOF_LONG 4
    | #define SIZEOF_CHAR_P 4
    | #define SIZEOF_SIZE_T 4
    | #define SIZEOF_UNSIGNED_LONG 4
    | #define HAVE_VSNPRINTF 1
    | #define HAVE_SNPRINTF 1
    | /* end confdefs.h.  */
    | #include <X11/Intrinsic.h>
    | int
    | main ()
    | {
    | XtMalloc(1)
    |   ;
    |   return 0;
    | }
    configure:28524: result: libraries /usr/X11R6/lib, headers /usr/X11R6/include
    configure:28553: checking for IceConnectionNumber in -lICE
    configure:28583: gcc -o conftest -std=iso9899:1990 -W -Wall -Wchar-subscripts -Wshadow -Wpointer-arith -Wmissing-prototypes -Wwrite-strings -D_XOPEN_SOURCE=500 -D_BSD_SOURCE -O2   -Wformat-security -Wmissing-format-attribute   -L/usr/X11R6/lib conftest.c -lICE   >&5
    /usr/bin/ld: cannot find -lICE
    collect2: ld returned 1 exit status
    configure:28589: $? = 1
    configure: failed program was:
    | /* confdefs.h.  */
    | 
    | #define PACKAGE_NAME ""
    | #define PACKAGE_TARNAME ""
    | #define PACKAGE_VERSION ""
    | #define PACKAGE_STRING ""
    | #define PACKAGE_BUGREPORT ""
    | #define PACKAGE "superkaramba-0.39"
    | #define VERSION "3.5.2"
    | #ifdef __cplusplus
    | extern "C" void std::exit (int) throw (); using std::exit;
    | #endif
    | #define KDELIBSUFF ""
    | #define STDC_HEADERS 1
    | #define HAVE_SYS_TYPES_H 1
    | #define HAVE_SYS_STAT_H 1
    | #define HAVE_STDLIB_H 1
    | #define HAVE_STRING_H 1
    | #define HAVE_MEMORY_H 1
    | #define HAVE_STRINGS_H 1
    | #define HAVE_INTTYPES_H 1
    | #define HAVE_STDINT_H 1
    | #define HAVE_UNISTD_H 1
    | #define HAVE_DLFCN_H 1
    | #define HAVE_SGI_STL 1
    | #define HAVE_CRYPT 1
    | #define kde_socklen_t socklen_t
    | #define ksize_t socklen_t
    | #define HAVE_SYS_TYPES_H 1
    | #define HAVE_STDINT_H 1
    | #define HAVE_SYS_BITYPES_H 1
    | #define HAVE_RES_INIT 1
    | #define HAVE_RES_INIT 1
    | #define HAVE_RES_INIT_PROTO 1
    | #define SIZEOF_INT 4
    | #define SIZEOF_SHORT 2
    | #define SIZEOF_LONG 4
    | #define SIZEOF_CHAR_P 4
    | #define SIZEOF_SIZE_T 4
    | #define SIZEOF_UNSIGNED_LONG 4
    | #define HAVE_VSNPRINTF 1
    | #define HAVE_SNPRINTF 1
    | /* end confdefs.h.  */
    | 
    | /* Override any gcc2 internal prototype to avoid an error.  */
    | #ifdef __cplusplus
    | extern "C"
    | #endif
    | /* We use char because int might match the return type of a gcc2
    |    builtin and then its argument prototype would still apply.  */
    | char IceConnectionNumber ();
    | int
    | main ()
    | {
    | IceConnectionNumber ();
    |   ;
    |   return 0;
    | }
    configure:28615: result: no
    configure:28625: checking for libXext
    configure:28660: gcc -o conftest -std=iso9899:1990 -W -Wall -Wchar-subscripts -Wshadow -Wpointer-arith -Wmissing-prototypes -Wwrite-strings -D_XOPEN_SOURCE=500 -D_BSD_SOURCE -O2   -Wformat-security -Wmissing-format-attribute   -L/usr/X11R6/lib  conftest.c -lXext -lX11  >&5
    configure:28666: $? = 0
    configure:28670: test -z 
    			 || test ! -s conftest.err
    configure:28673: $? = 0
    configure:28676: test -s conftest
    configure:28679: $? = 0
    configure:28698: result: yes
    configure:28933: checking for pthread_create in -lpthread
    configure:28963: gcc -o conftest -std=iso9899:1990 -W -Wall -Wchar-subscripts -Wshadow -Wpointer-arith -Wmissing-prototypes -Wwrite-strings -D_XOPEN_SOURCE=500 -D_BSD_SOURCE -O2   -Wformat-security -Wmissing-format-attribute   conftest.c -lpthread   >&5
    configure:28969: $? = 0
    configure:28973: test -z 
    			 || test ! -s conftest.err
    configure:28976: $? = 0
    configure:28979: test -s conftest
    configure:28982: $? = 0
    configure:28995: result: yes
    configure:29275: checking for extra includes
    configure:29303: result: no
    configure:29307: checking for extra libs
    configure:29336: result: no
    configure:29342: checking for libz
    configure:29377: gcc -o conftest -std=iso9899:1990 -W -Wall -Wchar-subscripts -Wshadow -Wpointer-arith -Wmissing-prototypes -Wwrite-strings -D_XOPEN_SOURCE=500 -D_BSD_SOURCE -O2   -Wformat-security -Wmissing-format-attribute -I/usr/X11R6/include   -D_REENTRANT  conftest.c -L/usr/X11R6/lib    -lz  >&5
    configure:29383: $? = 0
    configure:29387: test -z 
    			 || test ! -s conftest.err
    configure:29390: $? = 0
    configure:29393: test -s conftest
    configure:29396: $? = 0
    configure:29418: result: -lz
    configure:29439: checking for libpng
    configure:29476: gcc -o conftest -std=iso9899:1990 -W -Wall -Wchar-subscripts -Wshadow -Wpointer-arith -Wmissing-prototypes -Wwrite-strings -D_XOPEN_SOURCE=500 -D_BSD_SOURCE -O2   -Wformat-security -Wmissing-format-attribute -I/usr/X11R6/include   -D_REENTRANT  conftest.c  -L/usr/X11R6/lib    -lpng -lz -lm -lX11  >&5
    conftest.c:46:20: png.h: No such file or directory
    conftest.c: In function `main':
    conftest.c:52: error: `png_structp' undeclared (first use in this function)
    conftest.c:52: error: (Each undeclared identifier is reported only once
    conftest.c:52: error: for each function it appears in.)
    conftest.c:52: error: syntax error before "png_ptr"
    conftest.c:54: error: `png_ptr' undeclared (first use in this function)
    configure:29482: $? = 1
    configure: failed program was:
    | /* confdefs.h.  */
    | 
    | #define PACKAGE_NAME ""
    | #define PACKAGE_TARNAME ""
    | #define PACKAGE_VERSION ""
    | #define PACKAGE_STRING ""
    | #define PACKAGE_BUGREPORT ""
    | #define PACKAGE "superkaramba-0.39"
    | #define VERSION "3.5.2"
    | #ifdef __cplusplus
    | extern "C" void std::exit (int) throw (); using std::exit;
    | #endif
    | #define KDELIBSUFF ""
    | #define STDC_HEADERS 1
    | #define HAVE_SYS_TYPES_H 1
    | #define HAVE_SYS_STAT_H 1
    | #define HAVE_STDLIB_H 1
    | #define HAVE_STRING_H 1
    | #define HAVE_MEMORY_H 1
    | #define HAVE_STRINGS_H 1
    | #define HAVE_INTTYPES_H 1
    | #define HAVE_STDINT_H 1
    | #define HAVE_UNISTD_H 1
    | #define HAVE_DLFCN_H 1
    | #define HAVE_SGI_STL 1
    | #define HAVE_CRYPT 1
    | #define kde_socklen_t socklen_t
    | #define ksize_t socklen_t
    | #define HAVE_SYS_TYPES_H 1
    | #define HAVE_STDINT_H 1
    | #define HAVE_SYS_BITYPES_H 1
    | #define HAVE_RES_INIT 1
    | #define HAVE_RES_INIT 1
    | #define HAVE_RES_INIT_PROTO 1
    | #define SIZEOF_INT 4
    | #define SIZEOF_SHORT 2
    | #define SIZEOF_LONG 4
    | #define SIZEOF_CHAR_P 4
    | #define SIZEOF_SIZE_T 4
    | #define SIZEOF_UNSIGNED_LONG 4
    | #define HAVE_VSNPRINTF 1
    | #define HAVE_SNPRINTF 1
    | #define HAVE_LIBZ 1
    | /* end confdefs.h.  */
    | 
    |     #include<png.h>
    | 
    | int
    | main ()
    | {
    | 
    |     png_structp png_ptr = png_create_read_struct(  /* image ptr */
    | 		PNG_LIBPNG_VER_STRING, 0, 0, 0 );
    |     return( png_ptr != 0 );
    | 
    |   ;
    |   return 0;
    | }
    configure:29522: result: no
    configure:29530: checking for libjpeg6b
    configure:29564: gcc -o conftest -std=iso9899:1990 -W -Wall -Wchar-subscripts -Wshadow -Wpointer-arith -Wmissing-prototypes -Wwrite-strings -D_XOPEN_SOURCE=500 -D_BSD_SOURCE -O2   -Wformat-security -Wmissing-format-attribute -I/usr/X11R6/include   -D_REENTRANT  conftest.c -L/usr/X11R6/lib    -ljpeg6b -lm >&5
    /usr/bin/ld: cannot find -ljpeg6b
    collect2: ld returned 1 exit status
    configure:29570: $? = 1
    configure: failed program was:
    | /* confdefs.h.  */
    | 
    | #define PACKAGE_NAME ""
    | #define PACKAGE_TARNAME ""
    | #define PACKAGE_VERSION ""
    | #define PACKAGE_STRING ""
    | #define PACKAGE_BUGREPORT ""
    | #define PACKAGE "superkaramba-0.39"
    | #define VERSION "3.5.2"
    | #ifdef __cplusplus
    | extern "C" void std::exit (int) throw (); using std::exit;
    | #endif
    | #define KDELIBSUFF ""
    | #define STDC_HEADERS 1
    | #define HAVE_SYS_TYPES_H 1
    | #define HAVE_SYS_STAT_H 1
    | #define HAVE_STDLIB_H 1
    | #define HAVE_STRING_H 1
    | #define HAVE_MEMORY_H 1
    | #define HAVE_STRINGS_H 1
    | #define HAVE_INTTYPES_H 1
    | #define HAVE_STDINT_H 1
    | #define HAVE_UNISTD_H 1
    | #define HAVE_DLFCN_H 1
    | #define HAVE_SGI_STL 1
    | #define HAVE_CRYPT 1
    | #define kde_socklen_t socklen_t
    | #define ksize_t socklen_t
    | #define HAVE_SYS_TYPES_H 1
    | #define HAVE_STDINT_H 1
    | #define HAVE_SYS_BITYPES_H 1
    | #define HAVE_RES_INIT 1
    | #define HAVE_RES_INIT 1
    | #define HAVE_RES_INIT_PROTO 1
    | #define SIZEOF_INT 4
    | #define SIZEOF_SHORT 2
    | #define SIZEOF_LONG 4
    | #define SIZEOF_CHAR_P 4
    | #define SIZEOF_SIZE_T 4
    | #define SIZEOF_UNSIGNED_LONG 4
    | #define HAVE_VSNPRINTF 1
    | #define HAVE_SNPRINTF 1
    | #define HAVE_LIBZ 1
    | /* end confdefs.h.  */
    | 
    | #ifdef __cplusplus
    | extern "C" {
    | #endif
    | void jpeg_CreateDecompress();
    | #ifdef __cplusplus
    | }
    | #endif
    | 
    | int
    | main ()
    | {
    | jpeg_CreateDecompress();
    |   ;
    |   return 0;
    | }
    configure:29605: result: no
    configure:29608: checking for libjpeg
    configure:29642: gcc -o conftest -std=iso9899:1990 -W -Wall -Wchar-subscripts -Wshadow -Wpointer-arith -Wmissing-prototypes -Wwrite-strings -D_XOPEN_SOURCE=500 -D_BSD_SOURCE -O2   -Wformat-security -Wmissing-format-attribute -I/usr/X11R6/include   -D_REENTRANT  conftest.c -L/usr/X11R6/lib    -ljpeg -lm >&5
    /usr/bin/ld: cannot find -ljpeg
    collect2: ld returned 1 exit status
    configure:29648: $? = 1
    configure: failed program was:
    | /* confdefs.h.  */
    | 
    | #define PACKAGE_NAME ""
    | #define PACKAGE_TARNAME ""
    | #define PACKAGE_VERSION ""
    | #define PACKAGE_STRING ""
    | #define PACKAGE_BUGREPORT ""
    | #define PACKAGE "superkaramba-0.39"
    | #define VERSION "3.5.2"
    | #ifdef __cplusplus
    | extern "C" void std::exit (int) throw (); using std::exit;
    | #endif
    | #define KDELIBSUFF ""
    | #define STDC_HEADERS 1
    | #define HAVE_SYS_TYPES_H 1
    | #define HAVE_SYS_STAT_H 1
    | #define HAVE_STDLIB_H 1
    | #define HAVE_STRING_H 1
    | #define HAVE_MEMORY_H 1
    | #define HAVE_STRINGS_H 1
    | #define HAVE_INTTYPES_H 1
    | #define HAVE_STDINT_H 1
    | #define HAVE_UNISTD_H 1
    | #define HAVE_DLFCN_H 1
    | #define HAVE_SGI_STL 1
    | #define HAVE_CRYPT 1
    | #define kde_socklen_t socklen_t
    | #define ksize_t socklen_t
    | #define HAVE_SYS_TYPES_H 1
    | #define HAVE_STDINT_H 1
    | #define HAVE_SYS_BITYPES_H 1
    | #define HAVE_RES_INIT 1
    | #define HAVE_RES_INIT 1
    | #define HAVE_RES_INIT_PROTO 1
    | #define SIZEOF_INT 4
    | #define SIZEOF_SHORT 2
    | #define SIZEOF_LONG 4
    | #define SIZEOF_CHAR_P 4
    | #define SIZEOF_SIZE_T 4
    | #define SIZEOF_UNSIGNED_LONG 4
    | #define HAVE_VSNPRINTF 1
    | #define HAVE_SNPRINTF 1
    | #define HAVE_LIBZ 1
    | /* end confdefs.h.  */
    | 
    | #ifdef __cplusplus
    | extern "C" {
    | #endif
    | void jpeg_CreateDecompress();
    | #ifdef __cplusplus
    | }
    | #endif
    | 
    | int
    | main ()
    | {
    | jpeg_CreateDecompress();
    |   ;
    |   return 0;
    | }
    configure:29683: result: no
    configure: 29707: ${prefix}/include/jpeglib.h
    configure: 29707: /usr/include/jpeglib.h
    configure: 29707: /usr/local/include/jpeglib.h
    configure:29738: WARNING: libjpeg not found. disable JPEG support.
    configure:29751: checking for perl
    configure:29811: result: /usr/bin/perl
    configure:29937: checking for Qt
    configure: 30005: /usr/lib/qt3/include/qstyle.h
    configure: 30005: /usr/lib/qt3/qstyle.h
    configure: 30005: /usr/lib/qt/include/qstyle.h
    configure: 30005: /usr/lib/qt/qstyle.h
    configure: 30005: /usr/share/qt3/include/qstyle.h
    configure: 30005: /usr/share/qt3/qstyle.h
    configure: 30005: /usr/local/qt/include/qstyle.h
    configure: 30005: /usr/include/qt/qstyle.h
    configure: 30005: /usr/include/qstyle.h
    configure: 30005: /usr/X11R6/include/X11/qt/qstyle.h
    configure: 30005: /usr/X11R6/include/qt/qstyle.h
    configure: 30005: /usr/X11R6/include/qt2/qstyle.h
    configure: 30005: /usr/include/qt3/qstyle.h
    configure: 30005: /usr/X11R6/include/qstyle.h
    tried NO
    tried /usr/lib/qt3/lib
    tried /usr/lib/qt3
    tried /usr/lib/qt/lib
    tried /usr/lib/qt
    configure:30120: rm -rf SunWS_cache; g++ -o conftest -Wno-long-long -Wundef -ansi -D_XOPEN_SOURCE=500 -D_BSD_SOURCE -Wcast-align -Wconversion -Wchar-subscripts -Wall -W -Wpointer-arith -O2 -Wformat-security -Wmissing-format-attribute -Wno-non-virtual-dtor -fno-exceptions -fno-check-new -fno-common -INO -I/usr/X11R6/include  -DQT_THREAD_SUPPORT  -D_REENTRANT  -L/usr/share/qt3/lib -L/usr/X11R6/lib     conftest.cc  -lqt-mt   -ldl  -lXext -lX11   -lpthread 1>&5
    conftest.cc:2:21: qglobal.h: No such file or directory
    conftest.cc:3:26: qapplication.h: No such file or directory
    conftest.cc:4:21: qcursor.h: No such file or directory
    conftest.cc:5:27: qstylefactory.h: No such file or directory
    conftest.cc:6:34: private/qucomextra_p.h: No such file or directory
    conftest.cc:7:8: warning: "QT_VERSION" is not defined
    conftest.cc:8:2: #error 1
    conftest.cc: In function `int main()':
    conftest.cc:12: error: `QStyleFactory' undeclared (first use this function)
    conftest.cc:12: error: (Each undeclared identifier is reported only once for 
       each function it appears in.)
    conftest.cc:12: error: parse error before `::' token
    conftest.cc:13: error: `QCursor' undeclared (first use this function)
    configure:30123: $? = 1
    configure: failed program was:
    #include "confdefs.h"
    #include <qglobal.h>
    #include <qapplication.h>
    #include <qcursor.h>
    #include <qstylefactory.h>
    #include <private/qucomextra_p.h>
    #if ! (QT_VERSION >= 0x030300 && QT_VERSION < 0x040000)
    #error 1
    #endif
    
    int main() {
        (void)QStyleFactory::create(QString::null);
        QCursor c(Qt::WhatsThisCursor);
        return 0;
    }
    configure:30163: error: Qt (>= Qt 3.3 and < 4.0) (headers and libraries) not found. Please check your installation!
    For more details about this problem, look at the end of config.log.
    
    ## ---------------- ##
    ## Cache variables. ##
    ## ---------------- ##
    
    ac_cv_build=i686-pc-linux-gnu
    ac_cv_build_alias=i686-pc-linux-gnu
    ac_cv_c_compiler_gnu=yes
    ac_cv_cxx_compiler_gnu=yes
    ac_cv_env_CC_set=
    ac_cv_env_CC_value=
    ac_cv_env_CFLAGS_set=
    ac_cv_env_CFLAGS_value=
    ac_cv_env_CPPFLAGS_set=
    ac_cv_env_CPPFLAGS_value=
    ac_cv_env_CPP_set=
    ac_cv_env_CPP_value=
    ac_cv_env_CXXCPP_set=
    ac_cv_env_CXXCPP_value=
    ac_cv_env_CXXFLAGS_set=
    ac_cv_env_CXXFLAGS_value=
    ac_cv_env_CXX_set=
    ac_cv_env_CXX_value=
    ac_cv_env_F77_set=
    ac_cv_env_F77_value=
    ac_cv_env_FFLAGS_set=
    ac_cv_env_FFLAGS_value=
    ac_cv_env_LDFLAGS_set=
    ac_cv_env_LDFLAGS_value=
    ac_cv_env_build_alias_set=
    ac_cv_env_build_alias_value=
    ac_cv_env_host_alias_set=
    ac_cv_env_host_alias_value=
    ac_cv_env_target_alias_set=
    ac_cv_env_target_alias_value=
    ac_cv_exeext=
    ac_cv_f77_compiler_gnu=no
    ac_cv_func__NSGetEnviron=no
    ac_cv_func_connect=yes
    ac_cv_func_dlopen=no
    ac_cv_func_inet_ntoa=yes
    ac_cv_func_remove=yes
    ac_cv_func_shl_load=no
    ac_cv_func_shmat=yes
    ac_cv_func_snprintf=yes
    ac_cv_func_vsnprintf=yes
    ac_cv_have_dlfcn=yes
    ac_cv_have_qt=have_qt=no
    ac_cv_header_Carbon_Carbon_h=no
    ac_cv_header_CoreAudio_CoreAudio_h=no
    ac_cv_header_crt_externs_h=no
    ac_cv_header_dlfcn_h=yes
    ac_cv_header_inttypes_h=yes
    ac_cv_header_memory_h=yes
    ac_cv_header_stdc=yes
    ac_cv_header_stdint_h=yes
    ac_cv_header_stdlib_h=yes
    ac_cv_header_string_h=yes
    ac_cv_header_strings_h=yes
    ac_cv_header_sys_bitypes_h=yes
    ac_cv_header_sys_stat_h=yes
    ac_cv_header_sys_types_h=yes
    ac_cv_header_unistd_h=yes
    ac_cv_host=i686-pc-linux-gnu
    ac_cv_host_alias=i686-pc-linux-gnu
    ac_cv_lib_ICE_IceConnectionNumber=no
    ac_cv_lib_compat_main=no
    ac_cv_lib_crypt_crypt=yes
    ac_cv_lib_dl_dlopen=yes
    ac_cv_lib_dld_shl_load=no
    ac_cv_lib_dld_shl_unload=no
    ac_cv_lib_dnet_dnet_ntoa=no
    ac_cv_lib_dnet_stub_dnet_ntoa=no
    ac_cv_lib_jpeg_6b=no
    ac_cv_lib_jpeg_normal=no
    ac_cv_lib_png=no
    ac_cv_lib_poll_poll=no
    ac_cv_lib_pthread_pthread_create=yes
    ac_cv_lib_ucb_killpg=no
    ac_cv_lib_util_main=yes
    ac_cv_lib_z=-lz
    ac_cv_objext=o
    ac_cv_path_GMSGFMT=/usr/bin/msgfmt
    ac_cv_path_MSGFMT=/usr/bin/msgfmt
    ac_cv_path_XGETTEXT=/usr/bin/xgettext
    ac_cv_path_install='/usr/bin/install -c'
    ac_cv_prog_AWK=mawk
    ac_cv_prog_CPP='gcc -E'
    ac_cv_prog_CXXCPP='g++ -E'
    ac_cv_prog_ac_ct_AR=ar
    ac_cv_prog_ac_ct_CC=gcc
    ac_cv_prog_ac_ct_CXX=g++
    ac_cv_prog_ac_ct_RANLIB=ranlib
    ac_cv_prog_ac_ct_STRIP=strip
    ac_cv_prog_cc_g=yes
    ac_cv_prog_cc_stdc=
    ac_cv_prog_cxx_g=yes
    ac_cv_prog_egrep='grep -E'
    ac_cv_prog_f77_g=no
    ac_cv_prog_make_make_set=yes
    ac_cv_sizeof_char_p=4
    ac_cv_sizeof_int=4
    ac_cv_sizeof_long=4
    ac_cv_sizeof_short=2
    ac_cv_sizeof_size_t=4
    ac_cv_sizeof_unsigned_long=4
    ac_cv_target=i686-pc-linux-gnu
    ac_cv_target_alias=i686-pc-linux-gnu
    ac_cv_type_char_p=yes
    ac_cv_type_int=yes
    ac_cv_type_long=yes
    ac_cv_type_short=yes
    ac_cv_type_size_t=yes
    ac_cv_type_unsigned_long=yes
    am_cv_CC_dependencies_compiler_type=gcc3
    am_cv_CXX_dependencies_compiler_type=gcc3
    kde_cv_func_res_init=yes
    kde_cv_func_strlcat=no
    kde_cv_func_strlcpy=no
    kde_cv_have_libXext=yes
    kde_cv_have_x='have_x=yes          kde_x_includes=/usr/X11R6/include kde_x_libraries=/usr/X11R6/lib'
    kde_cv_opt_noinline_match=irrelevant
    kde_cv_path=/usr/bin/perl
    kde_cv_path_kde_config=/usr/bin/kde-config
    kde_cv_path_perl=/usr/bin/perl
    kde_cv_prog_cc_Wmissing_format_attribute=yes
    kde_cv_prog_cxx_O0=yes
    kde_cv_prog_cxx_Wl___allow_shlib_undefined=yes
    kde_cv_prog_cxx_Wl___no_undefined=yes
    kde_cv_prog_cxx_Wmissing_format_attribute=yes
    kde_cv_prog_cxx_Wno_long_long=yes
    kde_cv_prog_cxx_Wno_non_virtual_dtor=yes
    kde_cv_prog_cxx_Wundef=yes
    kde_cv_prog_cxx_fexceptions=yes
    kde_cv_prog_cxx_fno_check_new=yes
    kde_cv_prog_cxx_fno_common=yes
    kde_cv_prog_cxx_fno_exceptions=yes
    kde_cv_prog_cxx_fno_reorder_blocks=yes
    kde_cv_proto_res_init=no
    kde_cv_proto_strlcat='yes - in libkdefakes'
    kde_cv_proto_strlcpy='yes - in libkdefakes'
    kde_cv_socklen_t=yes
    kde_cv_socklen_t_equiv=socklen_t
    kde_cv_stl_works=yes
    kde_cv_val_pie_support=no
    lt_cv_deplibs_check_method=pass_all
    lt_cv_dlopen=dlopen
    lt_cv_dlopen_libs=-ldl
    lt_cv_dlopen_self=yes
    lt_cv_dlopen_self_static=yes
    lt_cv_file_magic_cmd='$MAGIC_CMD'
    lt_cv_file_magic_test_file='/lib/libc.so.6 /lib/libc-2.3.2.so'
    lt_cv_ld_reload_flag=-r
    lt_cv_objdir=.libs
    lt_cv_path_LD=/usr/bin/ld
    lt_cv_path_LDCXX=/usr/bin/ld
    lt_cv_path_NM='/usr/bin/nm -B'
    lt_cv_path_SED=/bin/sed
    lt_cv_prog_compiler_c_o=yes
    lt_cv_prog_compiler_c_o_CXX=yes
    lt_cv_prog_compiler_rtti_exceptions=no
    lt_cv_prog_gnu_ld=yes
    lt_cv_prog_gnu_ldcxx=yes
    lt_cv_sys_global_symbol_pipe='sed -n -e '\''s/^.*[ 	]\([ABCDGISTW][ABCDGISTW]*\)[ 	][ 	]*\(\)\([_A-Za-z][_A-Za-z0-9]*\)$/\1 \2\3 \3/p'\'''
    lt_cv_sys_global_symbol_to_c_name_address='sed -n -e '\''s/^: \([^ ]*\) $/  {\"\1\", (lt_ptr) 0},/p'\'' -e '\''s/^[BCDEGRST] \([^ ]*\) \([^ ]*\)$/  {"\2", (lt_ptr) \&\2},/p'\'''
    lt_cv_sys_global_symbol_to_cdecl='sed -n -e '\''s/^. .* \(.*\)$/extern int \1;/p'\'''
    lt_cv_sys_max_cmd_len=32768
    lt_lt_cv_prog_compiler_c_o='"yes"'
    lt_lt_cv_prog_compiler_c_o_CXX='"yes"'
    lt_lt_cv_sys_global_symbol_pipe='"sed -n -e '\''s/^.*[ 	]\\([ABCDGISTW][ABCDGISTW]*\\)[ 	][ 	]*\\(\\)\\([_A-Za-z][_A-Za-z0-9]*\\)\$/\\1 \\2\\3 \\3/p'\''"'
    lt_lt_cv_sys_global_symbol_to_c_name_address='"sed -n -e '\''s/^: \\([^ ]*\\) \$/  {\\\"\\1\\\", (lt_ptr) 0},/p'\'' -e '\''s/^[BCDEGRST] \\([^ ]*\\) \\([^ ]*\\)\$/  {\"\\2\", (lt_ptr) \\&\\2},/p'\''"'
    lt_lt_cv_sys_global_symbol_to_cdecl='"sed -n -e '\''s/^. .* \\(.*\\)\$/extern int \\1;/p'\''"'
    
    ## ----------------- ##
    ## Output variables. ##
    ## ----------------- ##
    
    ACLOCAL='${SHELL} /home/xetic/superkaramba-0.39/admin/missing --run aclocal-1.9'
    AMDEPBACKSLASH='\'
    AMDEP_FALSE='#'
    AMDEP_TRUE=''
    AMTAR='${SHELL} /home/xetic/superkaramba-0.39/admin/missing --run tar'
    AR='ar'
    ARTSCCONFIG=''
    AUTOCONF='$(SHELL) $(top_srcdir)/admin/cvs.sh configure || touch configure'
    AUTODIRS=''
    AUTOHEADER='${SHELL} /home/xetic/superkaramba-0.39/admin/missing --run autoheader'
    AUTOMAKE='${SHELL} /home/xetic/superkaramba-0.39/admin/missing --run automake-1.9'
    AWK='mawk'
    CC='gcc'
    CCDEPMODE='depmode=gcc3'
    CFLAGS='-std=iso9899:1990 -W -Wall -Wchar-subscripts -Wshadow -Wpointer-arith -Wmissing-prototypes -Wwrite-strings -D_XOPEN_SOURCE=500 -D_BSD_SOURCE -O2   -Wformat-security -Wmissing-format-attribute'
    CONF_FILES=' $(top_srcdir)/./admin/configure.in.min $(top_srcdir)/configure.in.in $(top_srcdir)/./superkaramba/configure.in.bot $(top_srcdir)/./superkaramba/configure.in.in'
    CPP='gcc -E'
    CPPFLAGS=' -DQT_THREAD_SUPPORT  -D_REENTRANT'
    CXX='g++'
    CXXCPP='g++ -E'
    CXXDEPMODE='depmode=gcc3'
    CXXFLAGS='-Wno-long-long -Wundef -ansi -D_XOPEN_SOURCE=500 -D_BSD_SOURCE -Wcast-align -Wconversion -Wchar-subscripts -Wall -W -Wpointer-arith -O2 -Wformat-security -Wmissing-format-attribute -Wno-non-virtual-dtor -fno-exceptions -fno-check-new -fno-common'
    CYGPATH_W='echo'
    DCOPIDL2CPP=''
    DCOPIDL=''
    DCOPIDLNG=''
    DCOP_DEPENDENCIES=''
    DEFS=''
    DEPDIR='.deps'
    DOXYGEN=''
    DOXYGEN_PROJECT_NAME=''
    DOXYGEN_PROJECT_NUMBER=''
    ECHO='echo'
    ECHO_C=''
    ECHO_N='-n'
    ECHO_T=''
    EGREP='grep -E'
    ENABLE_PERMISSIVE_FLAG='-fpermissive'
    EXEEXT=''
    F77=''
    FFLAGS=''
    FRAMEWORK_COREAUDIO=''
    GMSGFMT='/usr/bin/msgfmt'
    HAVE_GCC_VISIBILITY='0'
    INSTALL_DATA='${INSTALL} -m 644'
    INSTALL_PROGRAM='${INSTALL} $(INSTALL_STRIP_FLAG)'
    INSTALL_SCRIPT='${INSTALL}'
    INSTALL_STRIP_PROGRAM='${SHELL} $(install_sh) -c -s'
    KCFG_DEPENDENCIES=''
    KCONFIG_COMPILER=''
    KDECONFIG='/usr/bin/kde-config'
    KDE_CHECK_PLUGIN='$(KDE_PLUGIN) -rpath $(libdir)'
    KDE_EXTRA_RPATH=''
    KDE_HAS_DOXYGEN=''
    KDE_HAVE_DOT=''
    KDE_INCLUDES=''
    KDE_LDFLAGS=''
    KDE_MT_LDFLAGS=''
    KDE_MT_LIBS='-lpthread'
    KDE_NO_UNDEFINED='-Wl,--no-undefined -Wl,--allow-shlib-undefined'
    KDE_PLUGIN='-avoid-version -module -no-undefined $(KDE_NO_UNDEFINED) $(KDE_RPATH) $(KDE_MT_LDFLAGS)'
    KDE_RPATH=''
    KDE_USE_CLOSURE_FALSE=''
    KDE_USE_CLOSURE_TRUE='#'
    KDE_USE_FINAL_FALSE=''
    KDE_USE_FINAL_TRUE='#'
    KDE_USE_FPIE=''
    KDE_USE_NMCHECK_FALSE=''
    KDE_USE_NMCHECK_TRUE='#'
    KDE_USE_PIE=''
    KDE_XSL_STYLESHEET=''
    LDFLAGS=''
    LDFLAGS_AS_NEEDED=''
    LDFLAGS_NEW_DTAGS=''
    LIBCOMPAT=''
    LIBCRYPT='-lcrypt'
    LIBDL='-ldl'
    LIBJPEG=''
    LIBKVM=''
    LIBOBJS=''
    LIBPNG=''
    LIBPTHREAD='-lpthread'
    LIBPYTHON=''
    LIBRESOLV='-lresolv'
    LIBS=''
    LIBSM=''
    LIBSOCKET=''
    LIBTOOL='$(SHELL) $(top_builddir)/libtool --silent'
    LIBUCB=''
    LIBUTIL='-lutil'
    LIBZ='-lz'
    LIB_KAB=''
    LIB_KABC=''
    LIB_KDECORE=''
    LIB_KDED=''
    LIB_KDEPIM=''
    LIB_KDEPRINT=''
    LIB_KDEUI=''
    LIB_KDNSSD=''
    LIB_KFILE=''
    LIB_KFM=''
    LIB_KHTML=''
    LIB_KIMPROXY=''
    LIB_KIO=''
    LIB_KJS=''
    LIB_KNEWSTUFF=''
    LIB_KPARTS=''
    LIB_KSPELL=''
    LIB_KSYCOCA=''
    LIB_KUNITTEST=''
    LIB_KUTILS=''
    LIB_POLL=''
    LIB_QPE=''
    LIB_QT=''
    LIB_SMB=''
    LIB_X11='-lX11 $(LIBSOCKET)'
    LIB_XEXT='-lXext'
    LIB_XRENDER=''
    LN_S='ln -s'
    LTLIBOBJS=''
    MAKEINFO='${SHELL} /home/xetic/superkaramba-0.39/admin/missing --run makeinfo'
    MAKEKDEWIDGETS=''
    MCOPIDL=''
    MEINPROC=''
    MOC=''
    MSGFMT='/usr/bin/msgfmt'
    MY_LIBKNEWSTUFF=''
    NOOPT_CFLAGS='-O0'
    NOOPT_CXXFLAGS='-O0'
    OBJEXT='o'
    PACKAGE='superkaramba-0.39'
    PACKAGE_BUGREPORT=''
    PACKAGE_NAME=''
    PACKAGE_STRING=''
    PACKAGE_TARNAME=''
    PACKAGE_VERSION=''
    PATH_SEPARATOR=':'
    PERL='/usr/bin/perl'
    PYTHONINC=''
    PYTHONLIB=''
    PYTHONMODDIR=''
    QTDOCDIR=''
    QTE_NORTTI=''
    QT_INCLUDES=''
    QT_LDFLAGS=''
    RANLIB='ranlib'
    SET_MAKE=''
    SHELL='/bin/sh'
    STRIP='strip'
    TOPSUBDIRS=''
    UIC=''
    UIC_TR=''
    USER_INCLUDES=''
    USER_LDFLAGS=''
    USE_EXCEPTIONS='-fexceptions'
    USE_RTTI=''
    USE_THREADS=''
    VERSION='3.5.2'
    WOVERLOADED_VIRTUAL=''
    XGETTEXT='/usr/bin/xgettext'
    XMLLINT=''
    XMMS_INCLUDES=''
    XMMS_LDFLAGS=''
    XMMS_LIBS=''
    X_EXTRA_LIBS=''
    X_INCLUDES='-I/usr/X11R6/include'
    X_LDFLAGS='-L/usr/X11R6/lib'
    X_PRE_LIBS=''
    X_RPATH=''
    ac_ct_AR='ar'
    ac_ct_CC='gcc'
    ac_ct_CXX='g++'
    ac_ct_F77=''
    ac_ct_RANLIB='ranlib'
    ac_ct_STRIP='strip'
    all_includes='-I/usr/X11R6/include'
    all_libraries='-L/usr/X11R6/lib  '
    am__fastdepCC_FALSE='#'
    am__fastdepCC_TRUE=''
    am__fastdepCXX_FALSE='#'
    am__fastdepCXX_TRUE=''
    am__include='include'
    am__leading_dot='.'
    am__quote=''
    am__tar='${AMTAR} chof - "$$tardir"'
    am__untar='${AMTAR} xf -'
    bindir='${exec_prefix}/bin'
    build='i686-pc-linux-gnu'
    build_alias=''
    build_cpu='i686'
    build_os='linux-gnu'
    build_vendor='pc'
    datadir='${prefix}/share'
    doc_SUBDIR_included_FALSE=''
    doc_SUBDIR_included_TRUE=''
    exec_prefix='NONE'
    host='i686-pc-linux-gnu'
    host_alias=''
    host_cpu='i686'
    host_os='linux-gnu'
    host_vendor='pc'
    include_ARTS_FALSE=''
    include_ARTS_TRUE=''
    include_x11_FALSE='#'
    include_x11_TRUE=''
    includedir='${prefix}/include'
    infodir='${prefix}/info'
    install_sh='/home/xetic/superkaramba-0.39/admin/install-sh'
    kde_appsdir=''
    kde_bindir=''
    kde_confdir=''
    kde_datadir=''
    kde_htmldir=''
    kde_icondir=''
    kde_includes=''
    kde_kcfgdir=''
    kde_libraries=''
    kde_libs_htmldir='/usr/share/doc/kde/HTML'
    kde_libs_prefix='/usr'
    kde_locale=''
    kde_mimedir=''
    kde_moduledir=''
    kde_qtver='3'
    kde_servicesdir=''
    kde_servicetypesdir=''
    kde_sounddir=''
    kde_styledir=''
    kde_templatesdir=''
    kde_wallpaperdir=''
    kde_widgetdir=''
    kdeinitdir=''
    libdir='${exec_prefix}/lib'
    libexecdir='${exec_prefix}/libexec'
    localstatedir='${prefix}/var'
    mandir='${prefix}/man'
    mkdir_p='mkdir -p --'
    oldincludedir='/usr/include'
    prefix='/usr'
    program_transform_name='s,x,x,'
    qt_includes=''
    qt_libraries=''
    sbindir='${exec_prefix}/sbin'
    sharedstatedir='${prefix}/com'
    superkaramba_SUBDIR_included_FALSE=''
    superkaramba_SUBDIR_included_TRUE=''
    sysconfdir='${prefix}/etc'
    target='i686-pc-linux-gnu'
    target_alias=''
    target_cpu='i686'
    target_os='linux-gnu'
    target_vendor='pc'
    unsermake_enable_pch_FALSE=''
    unsermake_enable_pch_TRUE='#'
    x_includes='/usr/X11R6/include'
    x_libraries='/usr/X11R6/lib'
    xdg_appsdir=''
    xdg_directorydir=''
    xdg_menudir=''
    
    ## ----------- ##
    ## confdefs.h. ##
    ## ----------- ##
    
    #define HAVE_CRYPT 1
    #define HAVE_DLFCN_H 1
    #define HAVE_INTTYPES_H 1
    #define HAVE_LIBPTHREAD 1
    #define HAVE_LIBZ 1
    #define HAVE_MEMORY_H 1
    #define HAVE_RES_INIT 1
    #define HAVE_RES_INIT 1
    #define HAVE_RES_INIT_PROTO 1
    #define HAVE_SGI_STL 1
    #define HAVE_SNPRINTF 1
    #define HAVE_STDINT_H 1
    #define HAVE_STDINT_H 1
    #define HAVE_STDLIB_H 1
    #define HAVE_STRINGS_H 1
    #define HAVE_STRING_H 1
    #define HAVE_SYS_BITYPES_H 1
    #define HAVE_SYS_STAT_H 1
    #define HAVE_SYS_TYPES_H 1
    #define HAVE_SYS_TYPES_H 1
    #define HAVE_UNISTD_H 1
    #define HAVE_VSNPRINTF 1
    #define KDELIBSUFF ""
    #define PACKAGE "superkaramba-0.39"
    #define PACKAGE_BUGREPORT ""
    #define PACKAGE_NAME ""
    #define PACKAGE_STRING ""
    #define PACKAGE_TARNAME ""
    #define PACKAGE_VERSION ""
    #define SIZEOF_CHAR_P 4
    #define SIZEOF_INT 4
    #define SIZEOF_LONG 4
    #define SIZEOF_SHORT 2
    #define SIZEOF_SIZE_T 4
    #define SIZEOF_UNSIGNED_LONG 4
    #define STDC_HEADERS 1
    #define VERSION "3.5.2"
    #define kde_socklen_t socklen_t
    #define ksize_t socklen_t
    #endif
    #ifdef __cplusplus
    extern "C" void std::exit (int) throw (); using std::exit;
    
    configure: exit 1
    
    Habe schon alle libqt3 Packete installiert. Wenn ich im Packtmanager unter KDE nach qt3-devel Packete suche, findet der nix :(
    Könnt ihr mir vielleicht weiter helfen???

    PS: Wenn es zu lang ist nicht schlagen ?(
     
  2. Anzeige

    Schau dir mal diese Kategorie an. Dort findest du bestimmt etwas.
    Registrieren bzw. einloggen, um diese und auch andere Anzeigen zu deaktivieren
  3. Jabo

    Jabo Aufgabe ohne Minister

    Dabei seit:
    12.10.2006
    Beiträge:
    1.322
    Zustimmungen:
    0
    Ort:
    Hamburg
    Hallo,

    configure sucht nach den Qt-Headern (das sind wenn vorhanden die Pakete mit "devel" im Namen) und fondet sie nicht oder nciht in der richtigen Version.

    Header werden vom C-Compiler benötigt, in diesem Falle die von "Qt".

    Also mußt du die mal neu / nachinstallieren und dann noch mal checken...
     
  4. XET!C

    XET!C Tripel-As

    Dabei seit:
    02.08.2006
    Beiträge:
    191
    Zustimmungen:
    0
    Ort:
    Alfter / Bonn
    Ja hab ich alle, aber es gibt keine mit devel :(
    Und wenn ich nach Qt suche gibts gar keine
     
  5. #4 Atomara, 08.01.2007
    Atomara

    Atomara Debrandeter User

    Dabei seit:
    06.03.2004
    Beiträge:
    1.255
    Zustimmungen:
    0
    Ort:
    Deutschland , Nrw , Münsterland
    libqt3-headers haste das paket auch drinne ?
     
  6. XET!C

    XET!C Tripel-As

    Dabei seit:
    02.08.2006
    Beiträge:
    191
    Zustimmungen:
    0
    Ort:
    Alfter / Bonn
    Ne findet der auch nicht, kann ich auch nicht per apt installieren???
    Woher bekomme ich das
     
  7. #6 Atomara, 08.01.2007
    Atomara

    Atomara Debrandeter User

    Dabei seit:
    06.03.2004
    Beiträge:
    1.255
    Zustimmungen:
    0
    Ort:
    Deutschland , Nrw , Münsterland
    schau mal auf debian.org bei paketsuche
     
  8. #7 Goodspeed, 08.01.2007
    Goodspeed

    Goodspeed Foren Gott
    Moderator

    Dabei seit:
    21.04.2004
    Beiträge:
    4.165
    Zustimmungen:
    1
    Ort:
    Dresden
    Wo hast Du KDE 3.5 für Sarge her? Von www.backports.org?
    Wenn ja, warum nimmste nicht auch Superkaramba von dort?
     
  9. XET!C

    XET!C Tripel-As

    Dabei seit:
    02.08.2006
    Beiträge:
    191
    Zustimmungen:
    0
    Ort:
    Alfter / Bonn
    ja perfekt geht über apt danke
     
  10. #9 XET!C, 09.01.2007
    Zuletzt bearbeitet: 09.01.2007
    XET!C

    XET!C Tripel-As

    Dabei seit:
    02.08.2006
    Beiträge:
    191
    Zustimmungen:
    0
    Ort:
    Alfter / Bonn
    Trotzdem komm ich nicht an qt3 pakete vorbei. Jedes Programm will es haben, das installieren möchte. Aber woher bekomm ich es her. Debian.org geht aus irgendein Grund nicht :(
    Ok hab jetzt zwar das libqt3-dev paket runtergeladen, aber der sagt mir...
    Code:
    XETIC:/home/xetic# dpkg -i libqt3-dev_3.3.4-3sarge1_i386.deb
    (Lese Datenbank ... 88057 Dateien und Verzeichnisse sind derzeit installiert.)
    Vorbereiten zum Ersetzen von libqt3-dev 3:3.3.4-3sarge1 (durch libqt3-dev_3.3.4-3sarge1_i386.deb) ...
    Entpacke Ersatz für libqt3-dev ...
    dpkg: Abhängigkeitsprobleme verhindern Konfiguration von libqt3-dev:
     libqt3-dev hängt ab von libxrandr-dev (>= 4.3.0.dfsg.1-4); aber:
      Paket libxrandr-dev bereitstellt, ist nicht installiert.
     libqt3-dev hängt ab von libsm-dev (>= 4.3.0.dfsg.1-4); aber:
      Paket libsm-dev bereitstellt, ist nicht installiert.
     libqt3-dev hängt ab von libxmu-dev (>= 4.3.0.dfsg.1-4); aber:
      Paket libxmu-dev bereitstellt, ist nicht installiert.
     libqt3-dev hängt ab von libice-dev (>= 4.3.0.dfsg.1-4); aber:
      Paket libice-dev bereitstellt, ist nicht installiert.
     libqt3-dev hängt ab von libxt-dev (>= 4.3.0.dfsg.1-4); aber:
      Paket libxt-dev bereitstellt, ist nicht installiert.
     libqt3-dev hängt ab von libmng-dev (>= 1.0.3); aber:
      Paket libmng-dev bereitstellt, ist nicht installiert.
     libqt3-dev hängt ab von libpng12-dev | libpng12-0-dev; aber:
      Paket libpng12-dev bereitstellt, ist nicht installiert.
      Paket libpng12-0-dev bereitstellt, ist nicht installiert.
     libqt3-dev hängt ab von libjpeg62-dev; aber:
      Paket libjpeg62-dev bereitstellt, ist nicht installiert.
     libqt3-dev hängt ab von libfreetype6-dev; aber:
      Paket libfreetype6-dev bereitstellt, ist nicht installiert.
     libqt3-dev hängt ab von qt3-dev-tools (= 3:3.3.4-3sarge1); aber:
      Paket qt3-dev-tools bereitstellt, ist nicht installiert.
     libqt3-dev hängt ab von xlibmesa-gl-dev | libgl-dev; aber:
      Paket xlibmesa-gl-dev bereitstellt, ist nicht installiert.
      Paket libgl-dev bereitstellt, ist nicht installiert.
     libqt3-dev hängt ab von xlibmesa-glu-dev | libglu1-mesa-dev | libglu-dev; aber:
      Paket xlibmesa-glu-dev bereitstellt, ist nicht installiert.
      Paket libglu1-mesa-dev bereitstellt, ist nicht installiert.
      Paket libglu-dev bereitstellt, ist nicht installiert.
     libqt3-dev hängt ab von libxft-dev; aber:
      Paket libxft-dev bereitstellt, ist nicht installiert.
     libqt3-dev hängt ab von libxrender-dev; aber:
      Paket libxrender-dev bereitstellt, ist nicht installiert.
     libqt3-dev hängt ab von libxcursor-dev; aber:
      Paket libxcursor-dev bereitstellt, ist nicht installiert.
     libqt3-dev hängt ab von libaudio-dev; aber:
      Paket libaudio-dev bereitstellt, ist nicht installiert.
    dpkg: Fehler beim Bearbeiten von libqt3-dev (--install):
     Abhängigkeitsprobleme - lasse es unkonfiguriert
    Fehler traten auf beim Bearbeiten von:
     libqt3-dev
    XETIC:/home/xetic#
     
  11. #10 Goodspeed, 09.01.2007
    Goodspeed

    Goodspeed Foren Gott
    Moderator

    Dabei seit:
    21.04.2004
    Beiträge:
    4.165
    Zustimmungen:
    1
    Ort:
    Dresden
    Wie "debian.org" geht nicht?
    Naja ... libqt3-dev hat halt nen Haufen Abhängigkeiten. Und dpkg löst die nun mal nicht auf ... daher lieber apt nehmen ;)
     
  12. #11 knausser, 11.01.2007
    knausser

    knausser Grünschnabel

    Dabei seit:
    31.05.2006
    Beiträge:
    6
    Zustimmungen:
    0
    Ort:
    munich - down town
    Hallo,

    hat es einen bestimmten Grund warum Du superkaramba aus den Sourcen kompilieren willst ? Gibt es nicht auch deb-Packete - backports - dafür?

    Falls ich mich jetzt irre - kann mich bitte jemand der es besser weis berichtigen.

    Code:
    ich@Box:$~>apt-cache policy superkaramba
    superkaramba:
      Installiert:4:3.5.5-2
      Mögliche Pakete:4:3.5.5-2
      Versions-Tabelle:
     *** 4:3.5.5-2 0
            990 [url]http://ftp.de.debian.org[/url] testing/main Packages
            200 [url]http://ftp.de.debian.org[/url] unstable/main Packages
            100 /var/lib/dpkg/status
           4:3.5.0-2bpo1 0
              1 [url]http://ftp.de.debian.org[/url] sarge-backports/main Packages
    Bei habe ich zwar Debian etch installiert aber eventl. hilft Dir das backport debian-Packet weiter:

    Code:
    ich@Box:$~>cat /etc/apt/sources.list | grep backports
    deb http://ftp.de.debian.org/backports.org/                       sarge-backports            main contrib non-free
    Tschau & noch viel Erfolg
    Uli
     
  13. Anzeige

    Vielleicht findest du HIER Antworten.
    Registrieren bzw. einloggen, um diese und auch andere Anzeigen zu deaktivieren
  14. #12 Goodspeed, 11.01.2007
    Goodspeed

    Goodspeed Foren Gott
    Moderator

    Dabei seit:
    21.04.2004
    Beiträge:
    4.165
    Zustimmungen:
    1
    Ort:
    Dresden
    Weiß er doch schon ;)
     
  15. XET!C

    XET!C Tripel-As

    Dabei seit:
    02.08.2006
    Beiträge:
    191
    Zustimmungen:
    0
    Ort:
    Alfter / Bonn
    Trotzdem danke. Aber ich brauche generel die qt3 pakete...dev und lib
     
Thema:

Superkaramba @ Debian FEHLER????

Die Seite wird geladen...

Superkaramba @ Debian FEHLER???? - Ähnliche Themen

  1. Screenlet? gDesklet? Superkaramba?

    Screenlet? gDesklet? Superkaramba?: Hallo zusammen, habe nur eine ganz kurze Frage und zwar welches Widget wurde hier rechts auf dem Screen benutzt?...
  2. Superkaramba Ordnersymbol auf Desktop

    Superkaramba Ordnersymbol auf Desktop: Hi Leute, ich würde gerne eine superkaramba-anwendung programieren, aber mir fehlt ein wichtiger befehl dazu, vielleicht hat hier ja jemand eine...
  3. Ey SuperKaramba Problem - Plugins weg

    Ey SuperKaramba Problem - Plugins weg: Hi leute ich habe mir superkaramba installiert. Dort gibtes ja die möglichekit sich plugins direkt im Porgramm herunterzuladen und zu...
  4. Auslesen der Temperaturen über SuperKaramba

    Auslesen der Temperaturen über SuperKaramba: Hallo, Ich bin noch nicht ganz so lange bei Linux, benutze derzeit die Distribution Gentoo und habe derzeit ein Problem mit SuperKaramba. Und...
  5. Superkaramba & Liquidweather

    Superkaramba & Liquidweather: Hallo, ich habe ein Problem mit superkaramba & Liquidweather: Alles startet und das Wetter wird abgerufen, aber wenn ich den Config-Dialog...