Ndiswrapper

Dieses Thema im Forum "Debian/Ubuntu/Knoppix" wurde erstellt von St0r3d pr0, 08.01.2007.

  1. #1 St0r3d pr0, 08.01.2007
    St0r3d pr0

    St0r3d pr0 Jungspund

    Dabei seit:
    08.12.2006
    Beiträge:
    20
    Zustimmungen:
    0
    Sososo jetzt komm ich mal mit einer geneuen Fehlerprognose zurück. Ich probier die ganze zeit unter Ubuntu ndiswrapper zum laufen zu bringen. Ich hatte da was von kernel ressourcen gehört die ich brauch da hab ich von der debian Website mit die 2.6.8 version runtergeladen und installiert und danach sollte ja theoretisch mit make und make install alles funktionieren. (Habs als Root gemacht)

    Aber es kommt das:
    Code:
    stored@stored-1337:~$ su
    Password: 
    root@stored-1337:/home/stored# cd /media/CANON_DC/ndiswrapper-1.33
    root@stored-1337:/media/CANON_DC/ndiswrapper-1.33# make
    make -C driver
    make[1]: Betrete Verzeichnis '/media/CANON_DC/ndiswrapper-1.33/driver'
    make -C /lib/modules/2.6.17-10-generic/build SUBDIRS=/media/CANON_DC/ndiswrapper-1.33/driver
    make[2]: Betrete Verzeichnis '/usr/src/linux-headers-2.6.17-10-generic'
      Building modules, stage 2.
      MODPOST
    make[2]: Verlasse Verzeichnis '/usr/src/linux-headers-2.6.17-10-generic'
    make[1]: Verlasse Verzeichnis '/media/CANON_DC/ndiswrapper-1.33/driver'
    make -C utils
    make[1]: Betrete Verzeichnis '/media/CANON_DC/ndiswrapper-1.33/utils'
    gcc -g -Wall -I../driver -o loadndisdriver loadndisdriver.c
    loadndisdriver.c:15:20: error: stdlib.h: No such file or directory
    loadndisdriver.c:16:19: error: stdio.h: No such file or directory
    loadndisdriver.c:17:19: error: errno.h: No such file or directory
    loadndisdriver.c:18:20: error: string.h: No such file or directory
    loadndisdriver.c:19:20: error: libgen.h: No such file or directory
    loadndisdriver.c:21:22: error: sys/mman.h: No such file or directory
    loadndisdriver.c:23:23: error: sys/types.h: No such file or directory
    loadndisdriver.c:24:23: error: sys/ioctl.h: No such file or directory
    loadndisdriver.c:25:22: error: sys/stat.h: No such file or directory
    loadndisdriver.c:26:20: error: unistd.h: No such file or directory
    loadndisdriver.c:27:19: error: fcntl.h: No such file or directory
    In file included from /usr/lib/gcc/i486-linux-gnu/4.1.2/include/syslimits.h:7,
                     from /usr/lib/gcc/i486-linux-gnu/4.1.2/include/limits.h:11,
                     from loadndisdriver.c:28:
    /usr/lib/gcc/i486-linux-gnu/4.1.2/include/limits.h:122:61: error: limits.h: No such file or directory
    loadndisdriver.c:29:19: error: ctype.h: No such file or directory
    loadndisdriver.c:30:20: error: dirent.h: No such file or directory
    loadndisdriver.c:31:20: error: syslog.h: No such file or directory
    loadndisdriver.c:34:25: error: linux/major.h: No such file or directory
    loadndisdriver.c:35:25: error: linux/ioctl.h: No such file or directory
    In file included from loadndisdriver.c:37:
    ../driver/loader.h:24: error: expected specifier-qualifier-list before ‘size_t’
    loadndisdriver.c: In function ‘load_file’:
    loadndisdriver.c:67: error: ‘size_t’ undeclared (first use in this function)
    loadndisdriver.c:67: error: (Each undeclared identifier is reported only once
    loadndisdriver.c:67: error: for each function it appears in.)
    loadndisdriver.c:67: error: expected ‘;’ before ‘size’
    loadndisdriver.c:68: error: ‘NULL’ undeclared (first use in this function)
    loadndisdriver.c:69: error: storage size of ‘statbuf’ isn’t known
    loadndisdriver.c:71: warning: implicit declaration of function ‘basename’
    loadndisdriver.c:71: warning: initialization makes pointer from integer without a cast
    loadndisdriver.c:73: warning: implicit declaration of function ‘open’
    loadndisdriver.c:73: error: ‘O_RDONLY’ undeclared (first use in this function)
    loadndisdriver.c:75: warning: implicit declaration of function ‘syslog’
    loadndisdriver.c:75: error: ‘LOG_KERN’ undeclared (first use in this function)
    loadndisdriver.c:75: error: ‘LOG_INFO’ undeclared (first use in this function)
    loadndisdriver.c:75: warning: implicit declaration of function ‘strerror’
    loadndisdriver.c:75: error: ‘errno’ undeclared (first use in this function)
    loadndisdriver.c:76: error: ‘EINVAL’ undeclared (first use in this function)
    loadndisdriver.c:79: warning: implicit declaration of function ‘fstat’
    loadndisdriver.c:81: warning: implicit declaration of function ‘close’
    loadndisdriver.c:84: error: ‘size’ undeclared (first use in this function)
    loadndisdriver.c:86: warning: implicit declaration of function ‘mmap’
    loadndisdriver.c:86: error: ‘PROT_READ’ undeclared (first use in this function)
    loadndisdriver.c:86: error: ‘MAP_PRIVATE’ undeclared (first use in this function)
    loadndisdriver.c:86: warning: assignment makes pointer from integer without a cast
    loadndisdriver.c:87: error: ‘MAP_FAILED’ undeclared (first use in this function)
    loadndisdriver.c:93: warning: implicit declaration of function ‘strncpy’
    loadndisdriver.c:93: warning: incompatible implicit declaration of built-in function ‘strncpy’
    loadndisdriver.c:95: error: ‘struct load_driver_file’ has no member named ‘size’
    loadndisdriver.c:96: error: ‘struct load_driver_file’ has no member named ‘data’
    loadndisdriver.c:69: warning: unused variable ‘statbuf’
    loadndisdriver.c: In function ‘parse_setting_line’:
    loadndisdriver.c:109: warning: implicit declaration of function ‘isspace’
    loadndisdriver.c:115: warning: implicit declaration of function ‘strchr’
    loadndisdriver.c:115: warning: incompatible implicit declaration of built-in function ‘strchr’
    loadndisdriver.c:115: error: ‘NULL’ undeclared (first use in this function)
    loadndisdriver.c:117: error: ‘LOG_KERN’ undeclared (first use in this function)
    loadndisdriver.c:117: error: ‘LOG_INFO’ undeclared (first use in this function)
    loadndisdriver.c:118: error: ‘EINVAL’ undeclared (first use in this function)
    loadndisdriver.c:138: warning: implicit declaration of function ‘strlen’
    loadndisdriver.c:138: warning: incompatible implicit declaration of built-in function ‘strlen’
    loadndisdriver.c: In function ‘read_conf_file’:
    loadndisdriver.c:150: error: storage size of ‘statbuf’ isn’t known
    loadndisdriver.c:151: error: ‘FILE’ undeclared (first use in this function)
    loadndisdriver.c:151: error: ‘config’ undeclared (first use in this function)
    loadndisdriver.c:157: warning: implicit declaration of function ‘lstat’
    loadndisdriver.c:158: error: ‘LOG_KERN’ undeclared (first use in this function)
    loadndisdriver.c:158: error: ‘LOG_INFO’ undeclared (first use in this function)
    loadndisdriver.c:158: error: ‘errno’ undeclared (first use in this function)
    loadndisdriver.c:160: error: ‘EINVAL’ undeclared (first use in this function)
    loadndisdriver.c:163: warning: implicit declaration of function ‘sscanf’
    loadndisdriver.c:163: warning: incompatible implicit declaration of built-in function ‘sscanf’
    loadndisdriver.c:179: warning: implicit declaration of function ‘fopen’
    loadndisdriver.c:179: error: ‘NULL’ undeclared (first use in this function)
    loadndisdriver.c:183: warning: implicit declaration of function ‘fgets’
    loadndisdriver.c:195: warning: incompatible implicit declaration of built-in function ‘strncpy’
    loadndisdriver.c:206: warning: implicit declaration of function ‘fclose’
    loadndisdriver.c:150: warning: unused variable ‘statbuf’
    loadndisdriver.c: In function ‘load_bin_file’:
    loadndisdriver.c:218: error: ‘LOG_KERN’ undeclared (first use in this function)
    loadndisdriver.c:218: error: ‘LOG_INFO’ undeclared (first use in this function)
    loadndisdriver.c:220: warning: implicit declaration of function ‘tolower’
    loadndisdriver.c:222: warning: implicit declaration of function ‘chdir’
    loadndisdriver.c:223: error: ‘errno’ undeclared (first use in this function)
    loadndisdriver.c:225: error: ‘EINVAL’ undeclared (first use in this function)
    loadndisdriver.c:231: warning: incompatible implicit declaration of built-in function ‘strncpy’
    loadndisdriver.c:233: warning: implicit declaration of function ‘ioctl’
    loadndisdriver.c:233: warning: implicit declaration of function ‘_IOW’
    loadndisdriver.c:233: error: expected expression before ‘struct’
    loadndisdriver.c: In function ‘load_driver’:
    loadndisdriver.c:250: error: ‘DIR’ undeclared (first use in this function)
    loadndisdriver.c:250: error: ‘driver_dir’ undeclared (first use in this function)
    loadndisdriver.c:252: error: ‘NULL’ undeclared (first use in this function)
    loadndisdriver.c:256: error: ‘LOG_KERN’ undeclared (first use in this function)
    loadndisdriver.c:256: error: ‘LOG_INFO’ undeclared (first use in this function)
    loadndisdriver.c:258: error: ‘errno’ undeclared (first use in this function)
    loadndisdriver.c:260: error: ‘EINVAL’ undeclared (first use in this function)
    loadndisdriver.c:262: warning: implicit declaration of function ‘opendir’
    loadndisdriver.c:268: warning: implicit declaration of function ‘malloc’
    loadndisdriver.c:268: warning: incompatible implicit declaration of built-in function ‘malloc’
    loadndisdriver.c:272: warning: implicit declaration of function ‘memset’
    loadndisdriver.c:272: warning: incompatible implicit declaration of built-in function ‘memset’
    loadndisdriver.c:273: warning: incompatible implicit declaration of built-in function ‘strncpy’
    loadndisdriver.c:281: warning: implicit declaration of function ‘readdir’
    loadndisdriver.c:281: warning: assignment makes pointer from integer without a cast
    loadndisdriver.c:283: error: storage size of ‘statbuf’ isn’t known
    loadndisdriver.c:285: error: dereferencing pointer to incomplete type
    loadndisdriver.c:288: warning: implicit declaration of function ‘stat’
    loadndisdriver.c:288: error: dereferencing pointer to incomplete type
    loadndisdriver.c:289: warning: implicit declaration of function ‘S_ISREG’
    loadndisdriver.c:290: error: dereferencing pointer to incomplete type
    loadndisdriver.c:295: warning: incompatible implicit declaration of built-in function ‘strlen’
    loadndisdriver.c:295: error: dereferencing pointer to incomplete type
    loadndisdriver.c:297: warning: implicit declaration of function ‘strcasecmp’
    loadndisdriver.c:297: error: dereferencing pointer to incomplete type
    loadndisdriver.c:300: error: dereferencing pointer to incomplete type
    loadndisdriver.c:303: error: dereferencing pointer to incomplete type
    loadndisdriver.c:304: error: dereferencing pointer to incomplete type
    loadndisdriver.c:306: error: dereferencing pointer to incomplete type
    loadndisdriver.c:312: error: dereferencing pointer to incomplete type
    loadndisdriver.c:313: error: dereferencing pointer to incomplete type
    loadndisdriver.c:314: warning: implicit declaration of function ‘strcpy’
    loadndisdriver.c:314: warning: incompatible implicit declaration of built-in function ‘strcpy’
    loadndisdriver.c:315: error: dereferencing pointer to incomplete type
    loadndisdriver.c:318: error: ‘struct load_driver_file’ has no member named ‘size’
    loadndisdriver.c:319: error: ‘struct load_driver_file’ has no member named ‘data’
    loadndisdriver.c:322: error: dereferencing pointer to incomplete type
    loadndisdriver.c:283: warning: unused variable ‘statbuf’
    loadndisdriver.c:345: error: expected expression before ‘struct’
    loadndisdriver.c:347: warning: implicit declaration of function ‘closedir’
    loadndisdriver.c:349: warning: implicit declaration of function ‘free’
    loadndisdriver.c:356: warning: implicit declaration of function ‘munmap’
    loadndisdriver.c:356: error: ‘struct load_driver_file’ has no member named ‘data’
    loadndisdriver.c:356: error: ‘struct load_driver_file’ has no member named ‘size’
    loadndisdriver.c:358: error: ‘struct load_driver_file’ has no member named ‘data’
    loadndisdriver.c:358: error: ‘struct load_driver_file’ has no member named ‘size’
    loadndisdriver.c: In function ‘get_device’:
    loadndisdriver.c:368: error: storage size of ‘statbuf’ isn’t known
    loadndisdriver.c:371: error: ‘LOG_KERN’ undeclared (first use in this function)
    loadndisdriver.c:371: error: ‘LOG_INFO’ undeclared (first use in this function)
    loadndisdriver.c:374: error: ‘errno’ undeclared (first use in this function)
    loadndisdriver.c:375: error: ‘EINVAL’ undeclared (first use in this function)
    loadndisdriver.c:377: warning: implicit declaration of function ‘snprintf’
    loadndisdriver.c:377: warning: incompatible implicit declaration of built-in function ‘snprintf’
    loadndisdriver.c:408: warning: incompatible implicit declaration of built-in function ‘strncpy’
    loadndisdriver.c:368: warning: unused variable ‘statbuf’
    loadndisdriver.c: In function ‘load_device’:
    loadndisdriver.c:420: error: ‘DIR’ undeclared (first use in this function)
    loadndisdriver.c:420: error: ‘dir’ undeclared (first use in this function)
    loadndisdriver.c:424: error: ‘LOG_KERN’ undeclared (first use in this function)
    loadndisdriver.c:424: error: ‘LOG_INFO’ undeclared (first use in this function)
    loadndisdriver.c:425: warning: incompatible implicit declaration of built-in function ‘memset’
    loadndisdriver.c:427: error: ‘errno’ undeclared (first use in this function)
    loadndisdriver.c:428: error: ‘EINVAL’ undeclared (first use in this function)
    loadndisdriver.c:430: error: ‘NULL’ undeclared (first use in this function)
    loadndisdriver.c:435: warning: assignment makes pointer from integer without a cast
    loadndisdriver.c:436: error: dereferencing pointer to incomplete type
    loadndisdriver.c:437: error: dereferencing pointer to incomplete type
    loadndisdriver.c:440: error: dereferencing pointer to incomplete type
    loadndisdriver.c:449: error: expected expression before ‘struct’
    loadndisdriver.c: In function ‘get_ioctl_device’:
    loadndisdriver.c:466: error: ‘FILE’ undeclared (first use in this function)
    loadndisdriver.c:466: error: ‘proc_misc’ undeclared (first use in this function)
    loadndisdriver.c:474: warning: implicit declaration of function ‘strstr’
    loadndisdriver.c:474: warning: incompatible implicit declaration of built-in function ‘strstr’
    loadndisdriver.c:475: warning: implicit declaration of function ‘strtol’
    loadndisdriver.c:475: error: ‘NULL’ undeclared (first use in this function)
    loadndisdriver.c:485: error: ‘LOG_KERN’ undeclared (first use in this function)
    loadndisdriver.c:485: error: ‘LOG_INFO’ undeclared (first use in this function)
    loadndisdriver.c:490: warning: implicit declaration of function ‘unlink’
    loadndisdriver.c:491: warning: implicit declaration of function ‘mknod’
    loadndisdriver.c:491: error: ‘S_IFCHR’ undeclared (first use in this function)
    loadndisdriver.c:491: error: ‘MISC_MAJOR’ undeclared (first use in this function)
    loadndisdriver.c:492: error: ‘errno’ undeclared (first use in this function)
    loadndisdriver.c:497: error: ‘O_RDONLY’ undeclared (first use in this function)
    loadndisdriver.c: In function ‘main’:
    loadndisdriver.c:513: warning: implicit declaration of function ‘openlog’
    loadndisdriver.c:513: error: ‘LOG_PERROR’ undeclared (first use in this function)
    loadndisdriver.c:513: error: ‘LOG_CONS’ undeclared (first use in this function)
    loadndisdriver.c:513: error: ‘LOG_KERN’ undeclared (first use in this function)
    loadndisdriver.c:513: error: ‘LOG_DEBUG’ undeclared (first use in this function)
    loadndisdriver.c:515: error: ‘LOG_INFO’ undeclared (first use in this function)
    loadndisdriver.c:517: warning: implicit declaration of function ‘strncmp’
    loadndisdriver.c:519: warning: implicit declaration of function ‘printf’
    loadndisdriver.c:519: warning: incompatible implicit declaration of built-in function ‘printf’
    loadndisdriver.c:529: warning: implicit declaration of function ‘atoi’
    loadndisdriver.c:544: warning: implicit declaration of function ‘atof’
    loadndisdriver.c:551: warning: implicit declaration of function ‘strcmp’
    loadndisdriver.c:558: warning: incompatible implicit declaration of built-in function ‘sscanf’
    loadndisdriver.c:592: warning: implicit declaration of function ‘closelog’
    make[1]: *** [loadndisdriver] Fehler 1
    make[1]: Verlasse Verzeichnis '/media/CANON_DC/ndiswrapper-1.33/utils'
    make: *** [all] Fehler 2
    root@stored-1337:/media/CANON_DC/ndiswrapper-1.33# make install
    make -C driver install
    make[1]: Betrete Verzeichnis '/media/CANON_DC/ndiswrapper-1.33/driver'
    make -C /lib/modules/2.6.17-10-generic/build SUBDIRS=/media/CANON_DC/ndiswrapper-1.33/driver
    make[2]: Betrete Verzeichnis '/usr/src/linux-headers-2.6.17-10-generic'
      Building modules, stage 2.
      MODPOST
    make[2]: Verlasse Verzeichnis '/usr/src/linux-headers-2.6.17-10-generic'
    echo /lib/modules/2.6.17-10-generic/misc
    /lib/modules/2.6.17-10-generic/misc
    mkdir -p /lib/modules/2.6.17-10-generic/misc
    install -m 0644 ndiswrapper.ko /lib/modules/2.6.17-10-generic/misc
    /sbin/depmod -a 2.6.17-10-generic -b /
    make[1]: Verlasse Verzeichnis '/media/CANON_DC/ndiswrapper-1.33/driver'
    make -C utils install
    make[1]: Betrete Verzeichnis '/media/CANON_DC/ndiswrapper-1.33/utils'
    gcc -g -Wall -I../driver -o loadndisdriver loadndisdriver.c
    loadndisdriver.c:15:20: error: stdlib.h: No such file or directory
    loadndisdriver.c:16:19: error: stdio.h: No such file or directory
    loadndisdriver.c:17:19: error: errno.h: No such file or directory
    loadndisdriver.c:18:20: error: string.h: No such file or directory
    loadndisdriver.c:19:20: error: libgen.h: No such file or directory
    loadndisdriver.c:21:22: error: sys/mman.h: No such file or directory
    loadndisdriver.c:23:23: error: sys/types.h: No such file or directory
    loadndisdriver.c:24:23: error: sys/ioctl.h: No such file or directory
    loadndisdriver.c:25:22: error: sys/stat.h: No such file or directory
    loadndisdriver.c:26:20: error: unistd.h: No such file or directory
    loadndisdriver.c:27:19: error: fcntl.h: No such file or directory
    In file included from /usr/lib/gcc/i486-linux-gnu/4.1.2/include/syslimits.h:7,
                     from /usr/lib/gcc/i486-linux-gnu/4.1.2/include/limits.h:11,
                     from loadndisdriver.c:28:
    /usr/lib/gcc/i486-linux-gnu/4.1.2/include/limits.h:122:61: error: limits.h: No such file or directory
    loadndisdriver.c:29:19: error: ctype.h: No such file or directory
    loadndisdriver.c:30:20: error: dirent.h: No such file or directory
    loadndisdriver.c:31:20: error: syslog.h: No such file or directory
    loadndisdriver.c:34:25: error: linux/major.h: No such file or directory
    loadndisdriver.c:35:25: error: linux/ioctl.h: No such file or directory
    In file included from loadndisdriver.c:37:
    ../driver/loader.h:24: error: expected specifier-qualifier-list before ‘size_t’
    loadndisdriver.c: In function ‘load_file’:
    loadndisdriver.c:67: error: ‘size_t’ undeclared (first use in this function)
    loadndisdriver.c:67: error: (Each undeclared identifier is reported only once
    loadndisdriver.c:67: error: for each function it appears in.)
    loadndisdriver.c:67: error: expected ‘;’ before ‘size’
    loadndisdriver.c:68: error: ‘NULL’ undeclared (first use in this function)
    loadndisdriver.c:69: error: storage size of ‘statbuf’ isn’t known
    loadndisdriver.c:71: warning: implicit declaration of function ‘basename’
    loadndisdriver.c:71: warning: initialization makes pointer from integer without a cast
    loadndisdriver.c:73: warning: implicit declaration of function ‘open’
    loadndisdriver.c:73: error: ‘O_RDONLY’ undeclared (first use in this function)
    loadndisdriver.c:75: warning: implicit declaration of function ‘syslog’
    loadndisdriver.c:75: error: ‘LOG_KERN’ undeclared (first use in this function)
    loadndisdriver.c:75: error: ‘LOG_INFO’ undeclared (first use in this function)
    loadndisdriver.c:75: warning: implicit declaration of function ‘strerror’
    loadndisdriver.c:75: error: ‘errno’ undeclared (first use in this function)
    loadndisdriver.c:76: error: ‘EINVAL’ undeclared (first use in this function)
    loadndisdriver.c:79: warning: implicit declaration of function ‘fstat’
    loadndisdriver.c:81: warning: implicit declaration of function ‘close’
    loadndisdriver.c:84: error: ‘size’ undeclared (first use in this function)
    loadndisdriver.c:86: warning: implicit declaration of function ‘mmap’
    loadndisdriver.c:86: error: ‘PROT_READ’ undeclared (first use in this function)
    loadndisdriver.c:86: error: ‘MAP_PRIVATE’ undeclared (first use in this function)
    loadndisdriver.c:86: warning: assignment makes pointer from integer without a cast
    loadndisdriver.c:87: error: ‘MAP_FAILED’ undeclared (first use in this function)
    loadndisdriver.c:93: warning: implicit declaration of function ‘strncpy’
    loadndisdriver.c:93: warning: incompatible implicit declaration of built-in function ‘strncpy’
    loadndisdriver.c:95: error: ‘struct load_driver_file’ has no member named ‘size’
    loadndisdriver.c:96: error: ‘struct load_driver_file’ has no member named ‘data’
    loadndisdriver.c:69: warning: unused variable ‘statbuf’
    loadndisdriver.c: In function ‘parse_setting_line’:
    loadndisdriver.c:109: warning: implicit declaration of function ‘isspace’
    loadndisdriver.c:115: warning: implicit declaration of function ‘strchr’
    loadndisdriver.c:115: warning: incompatible implicit declaration of built-in function ‘strchr’
    loadndisdriver.c:115: error: ‘NULL’ undeclared (first use in this function)
    loadndisdriver.c:117: error: ‘LOG_KERN’ undeclared (first use in this function)
    loadndisdriver.c:117: error: ‘LOG_INFO’ undeclared (first use in this function)
    loadndisdriver.c:118: error: ‘EINVAL’ undeclared (first use in this function)
    loadndisdriver.c:138: warning: implicit declaration of function ‘strlen’
    loadndisdriver.c:138: warning: incompatible implicit declaration of built-in function ‘strlen’
    loadndisdriver.c: In function ‘read_conf_file’:
    loadndisdriver.c:150: error: storage size of ‘statbuf’ isn’t known
    loadndisdriver.c:151: error: ‘FILE’ undeclared (first use in this function)
    loadndisdriver.c:151: error: ‘config’ undeclared (first use in this function)
    loadndisdriver.c:157: warning: implicit declaration of function ‘lstat’
    loadndisdriver.c:158: error: ‘LOG_KERN’ undeclared (first use in this function)
    loadndisdriver.c:158: error: ‘LOG_INFO’ undeclared (first use in this function)
    loadndisdriver.c:158: error: ‘errno’ undeclared (first use in this function)
    loadndisdriver.c:160: error: ‘EINVAL’ undeclared (first use in this function)
    loadndisdriver.c:163: warning: implicit declaration of function ‘sscanf’
    loadndisdriver.c:163: warning: incompatible implicit declaration of built-in function ‘sscanf’
    loadndisdriver.c:179: warning: implicit declaration of function ‘fopen’
    loadndisdriver.c:179: error: ‘NULL’ undeclared (first use in this function)
    loadndisdriver.c:183: warning: implicit declaration of function ‘fgets’
    loadndisdriver.c:195: warning: incompatible implicit declaration of built-in function ‘strncpy’
    loadndisdriver.c:206: warning: implicit declaration of function ‘fclose’
    loadndisdriver.c:150: warning: unused variable ‘statbuf’
    loadndisdriver.c: In function ‘load_bin_file’:
    loadndisdriver.c:218: error: ‘LOG_KERN’ undeclared (first use in this function)
    loadndisdriver.c:218: error: ‘LOG_INFO’ undeclared (first use in this function)
    loadndisdriver.c:220: warning: implicit declaration of function ‘tolower’
    loadndisdriver.c:222: warning: implicit declaration of function ‘chdir’
    loadndisdriver.c:223: error: ‘errno’ undeclared (first use in this function)
    loadndisdriver.c:225: error: ‘EINVAL’ undeclared (first use in this function)
    loadndisdriver.c:231: warning: incompatible implicit declaration of built-in function ‘strncpy’
    loadndisdriver.c:233: warning: implicit declaration of function ‘ioctl’
    loadndisdriver.c:233: warning: implicit declaration of function ‘_IOW’
    loadndisdriver.c:233: error: expected expression before ‘struct’
    loadndisdriver.c: In function ‘load_driver’:
    loadndisdriver.c:250: error: ‘DIR’ undeclared (first use in this function)
    loadndisdriver.c:250: error: ‘driver_dir’ undeclared (first use in this function)
    loadndisdriver.c:252: error: ‘NULL’ undeclared (first use in this function)
    loadndisdriver.c:256: error: ‘LOG_KERN’ undeclared (first use in this function)
    loadndisdriver.c:256: error: ‘LOG_INFO’ undeclared (first use in this function)
    loadndisdriver.c:258: error: ‘errno’ undeclared (first use in this function)
    loadndisdriver.c:260: error: ‘EINVAL’ undeclared (first use in this function)
    loadndisdriver.c:262: warning: implicit declaration of function ‘opendir’
    loadndisdriver.c:268: warning: implicit declaration of function ‘malloc’
    loadndisdriver.c:268: warning: incompatible implicit declaration of built-in function ‘malloc’
    loadndisdriver.c:272: warning: implicit declaration of function ‘memset’
    loadndisdriver.c:272: warning: incompatible implicit declaration of built-in function ‘memset’
    loadndisdriver.c:273: warning: incompatible implicit declaration of built-in function ‘strncpy’
    loadndisdriver.c:281: warning: implicit declaration of function ‘readdir’
    loadndisdriver.c:281: warning: assignment makes pointer from integer without a cast
    loadndisdriver.c:283: error: storage size of ‘statbuf’ isn’t known
    loadndisdriver.c:285: error: dereferencing pointer to incomplete type
    loadndisdriver.c:288: warning: implicit declaration of function ‘stat’
    loadndisdriver.c:288: error: dereferencing pointer to incomplete type
    loadndisdriver.c:289: warning: implicit declaration of function ‘S_ISREG’
    loadndisdriver.c:290: error: dereferencing pointer to incomplete type
    loadndisdriver.c:295: warning: incompatible implicit declaration of built-in function ‘strlen’
    loadndisdriver.c:295: error: dereferencing pointer to incomplete type
    loadndisdriver.c:297: warning: implicit declaration of function ‘strcasecmp’
    loadndisdriver.c:297: error: dereferencing pointer to incomplete type
    loadndisdriver.c:300: error: dereferencing pointer to incomplete type
    loadndisdriver.c:303: error: dereferencing pointer to incomplete type
    loadndisdriver.c:304: error: dereferencing pointer to incomplete type
    loadndisdriver.c:306: error: dereferencing pointer to incomplete type
    loadndisdriver.c:312: error: dereferencing pointer to incomplete type
    loadndisdriver.c:313: error: dereferencing pointer to incomplete type
    loadndisdriver.c:314: warning: implicit declaration of function ‘strcpy’
    loadndisdriver.c:314: warning: incompatible implicit declaration of built-in function ‘strcpy’
    loadndisdriver.c:315: error: dereferencing pointer to incomplete type
    loadndisdriver.c:318: error: ‘struct load_driver_file’ has no member named ‘size’
    loadndisdriver.c:319: error: ‘struct load_driver_file’ has no member named ‘data’
    loadndisdriver.c:322: error: dereferencing pointer to incomplete type
    loadndisdriver.c:283: warning: unused variable ‘statbuf’
    loadndisdriver.c:345: error: expected expression before ‘struct’
    loadndisdriver.c:347: warning: implicit declaration of function ‘closedir’
    loadndisdriver.c:349: warning: implicit declaration of function ‘free’
    loadndisdriver.c:356: warning: implicit declaration of function ‘munmap’
    loadndisdriver.c:356: error: ‘struct load_driver_file’ has no member named ‘data’
    loadndisdriver.c:356: error: ‘struct load_driver_file’ has no member named ‘size’
    loadndisdriver.c:358: error: ‘struct load_driver_file’ has no member named ‘data’
    loadndisdriver.c:358: error: ‘struct load_driver_file’ has no member named ‘size’
    loadndisdriver.c: In function ‘get_device’:
    loadndisdriver.c:368: error: storage size of ‘statbuf’ isn’t known
    loadndisdriver.c:371: error: ‘LOG_KERN’ undeclared (first use in this function)
    loadndisdriver.c:371: error: ‘LOG_INFO’ undeclared (first use in this function)
    loadndisdriver.c:374: error: ‘errno’ undeclared (first use in this function)
    loadndisdriver.c:375: error: ‘EINVAL’ undeclared (first use in this function)
    loadndisdriver.c:377: warning: implicit declaration of function ‘snprintf’
    loadndisdriver.c:377: warning: incompatible implicit declaration of built-in function ‘snprintf’
    loadndisdriver.c:408: warning: incompatible implicit declaration of built-in function ‘strncpy’
    loadndisdriver.c:368: warning: unused variable ‘statbuf’
    loadndisdriver.c: In function ‘load_device’:
    loadndisdriver.c:420: error: ‘DIR’ undeclared (first use in this function)
    loadndisdriver.c:420: error: ‘dir’ undeclared (first use in this function)
    loadndisdriver.c:424: error: ‘LOG_KERN’ undeclared (first use in this function)
    loadndisdriver.c:424: error: ‘LOG_INFO’ undeclared (first use in this function)
    loadndisdriver.c:425: warning: incompatible implicit declaration of built-in function ‘memset’
    loadndisdriver.c:427: error: ‘errno’ undeclared (first use in this function)
    loadndisdriver.c:428: error: ‘EINVAL’ undeclared (first use in this function)
    loadndisdriver.c:430: error: ‘NULL’ undeclared (first use in this function)
    loadndisdriver.c:435: warning: assignment makes pointer from integer without a cast
    loadndisdriver.c:436: error: dereferencing pointer to incomplete type
    loadndisdriver.c:437: error: dereferencing pointer to incomplete type
    loadndisdriver.c:440: error: dereferencing pointer to incomplete type
    loadndisdriver.c:449: error: expected expression before ‘struct’
    loadndisdriver.c: In function ‘get_ioctl_device’:
    loadndisdriver.c:466: error: ‘FILE’ undeclared (first use in this function)
    loadndisdriver.c:466: error: ‘proc_misc’ undeclared (first use in this function)
    loadndisdriver.c:474: warning: implicit declaration of function ‘strstr’
    loadndisdriver.c:474: warning: incompatible implicit declaration of built-in function ‘strstr’
    loadndisdriver.c:475: warning: implicit declaration of function ‘strtol’
    loadndisdriver.c:475: error: ‘NULL’ undeclared (first use in this function)
    loadndisdriver.c:485: error: ‘LOG_KERN’ undeclared (first use in this function)
    loadndisdriver.c:485: error: ‘LOG_INFO’ undeclared (first use in this function)
    loadndisdriver.c:490: warning: implicit declaration of function ‘unlink’
    loadndisdriver.c:491: warning: implicit declaration of function ‘mknod’
    loadndisdriver.c:491: error: ‘S_IFCHR’ undeclared (first use in this function)
    loadndisdriver.c:491: error: ‘MISC_MAJOR’ undeclared (first use in this function)
    loadndisdriver.c:492: error: ‘errno’ undeclared (first use in this function)
    loadndisdriver.c:497: error: ‘O_RDONLY’ undeclared (first use in this function)
    loadndisdriver.c: In function ‘main’:
    loadndisdriver.c:513: warning: implicit declaration of function ‘openlog’
    loadndisdriver.c:513: error: ‘LOG_PERROR’ undeclared (first use in this function)
    loadndisdriver.c:513: error: ‘LOG_CONS’ undeclared (first use in this function)
    loadndisdriver.c:513: error: ‘LOG_KERN’ undeclared (first use in this function)
    loadndisdriver.c:513: error: ‘LOG_DEBUG’ undeclared (first use in this function)
    loadndisdriver.c:515: error: ‘LOG_INFO’ undeclared (first use in this function)
    loadndisdriver.c:517: warning: implicit declaration of function ‘strncmp’
    loadndisdriver.c:519: warning: implicit declaration of function ‘printf’
    loadndisdriver.c:519: warning: incompatible implicit declaration of built-in function ‘printf’
    loadndisdriver.c:529: warning: implicit declaration of function ‘atoi’
    loadndisdriver.c:544: warning: implicit declaration of function ‘atof’
    loadndisdriver.c:551: warning: implicit declaration of function ‘strcmp’
    loadndisdriver.c:558: warning: incompatible implicit declaration of built-in function ‘sscanf’
    loadndisdriver.c:592: warning: implicit declaration of function ‘closelog’
    make[1]: *** [loadndisdriver] Fehler 1
    make[1]: Verlasse Verzeichnis '/media/CANON_DC/ndiswrapper-1.33/utils'
    make: *** [install] Fehler 2
    
    Vieleicht wist ihr was das heist. Ich denke das er es nicht schaft Treiber zu installieren aber warum? Was kann ich tun?

    Und noch ich kann keine Packete in Linux ausm Inet ziehen ich muss immer Windows und Linux switchen!

    Mfg Stored
     
  2. Anzeige

    Schau dir mal diese Kategorie an. Dort findest du bestimmt etwas.
    Registrieren bzw. einloggen, um diese und auch andere Anzeigen zu deaktivieren
  3. theton

    theton Bitmuncher

    Dabei seit:
    27.05.2004
    Beiträge:
    4.820
    Zustimmungen:
    0
    Ort:
    Berlin, Germany
    Wie wäre es, wenn du ndiswrapper einfach über apt installierst?
    http://ubuntuguide.org/wiki/Ubuntu_Edgy#How_to_install_Windows_Wireless_Drivers_.28Ndiswrapper.29

    (Diesen Link poste ich jetzt hier min. schon das 3. Mal in den letzten 2 Wochen. Benutze also in Zukunft bitte die Boardsuche).

    Deine Fehler beim Kompilieren haben übrigens ihre Ursache darin, dass du die dev-Pakete der libc nicht installiert hast und auch das notwendige Kernel-Modul-Build-Environment wirst du wahrscheinlich nicht eingerichtet haben: http://www.hackerwiki.org/index.php/Kernel_Module_Build_Environment_unter_Debian_einrichten
     
  4. #3 St0r3d pr0, 08.01.2007
    St0r3d pr0

    St0r3d pr0 Jungspund

    Dabei seit:
    08.12.2006
    Beiträge:
    20
    Zustimmungen:
    0
    Jo ne sowas hab ich auch schon oft gefunden ne ich hab im Linux kein inet und spt-get zieht das zeug ausm inet raus. Ich brauch ne möglichkeit das ohne zu installieren den Source hab ich aber da kommt obiger fehler.

    Ich habe so ne Kernel Source schon isntalliert ob es nun die richtige ist oder war ka. Aber das sind wieder solche apt-get befehle. Wozu richte ich ndiswrapper ein wenn ich schon inet hätte?
     
  5. daboss

    daboss Keine Macht für niemand!

    Dabei seit:
    05.01.2007
    Beiträge:
    1.294
    Zustimmungen:
    0
    Ort:
    sydney.australia.world
    Trag doch deine Ubunut-CDs / DVD als Quellen ins Synaptic ein bzw "des Internet raus" ^^ Da sollt des ja mit drauf sein?
     
  6. theton

    theton Bitmuncher

    Dabei seit:
    27.05.2004
    Beiträge:
    4.820
    Zustimmungen:
    0
    Ort:
    Berlin, Germany
    Jep, ndiswrapper sollte eigentlich auf der CD sein. Alternativ das Paket runterladen und mit 'sudo dpkg -i paketdatei' installieren.
     
  7. Anzeige

    Vielleicht findest du HIER Antworten.
    Registrieren bzw. einloggen, um diese und auch andere Anzeigen zu deaktivieren
  8. #6 St0r3d pr0, 09.01.2007
    St0r3d pr0

    St0r3d pr0 Jungspund

    Dabei seit:
    08.12.2006
    Beiträge:
    20
    Zustimmungen:
    0
    Achos ich dachte nur das bei Suse alles mitgliefert ist. Das waren auch 5 CD's. Und Ubuntu nur eine CD da dacht ich müste man alles ausm inet ziehen :)

    Nagut ich probiers heut mal so aus :) Danke

    Mfg Stored
     
  9. #7 kbdcalls, 09.01.2007
    kbdcalls

    kbdcalls Master of Universe

    Dabei seit:
    16.10.2006
    Beiträge:
    518
    Zustimmungen:
    0
    Du kriegst Ubuntu auch auf DVD.
     
Thema:

Ndiswrapper

Die Seite wird geladen...

Ndiswrapper - Ähnliche Themen

  1. Ubuntu 9.10 ndiswrapper compile problem

    Ubuntu 9.10 ndiswrapper compile problem: Nunja, nachdem ndiswrapper (von apt-get installiert) probleme macht, weil das module nicht gefunden wird, dachte ich mir, kompilierst du es eben...
  2. LinuxMint wg111v3 ndiswrapper Probleme

    LinuxMint wg111v3 ndiswrapper Probleme: Hallo, wollte mal nach einiger Zeit wieder versuchen Wlan unter Linux aktiviert zu kriegen. Als Distribution habe ich diesmal LinuxMint gewählt...
  3. Installation von ndiswrapper schlägt fehl. [+allgemeine Frage]

    Installation von ndiswrapper schlägt fehl. [+allgemeine Frage]: Problem bereits behoben! So liebe User, der andere Thread ging irgendwie unter, und so richtig helfen konnte man mir auch nicht.... Ich habe ein...
  4. openSUSE und ndiswrapper. Der 1. Bug?

    openSUSE und ndiswrapper. Der 1. Bug?: Nun habe ich voller vorfreude bei mir 11.1 drauf gemacht, aber was muss ich sehen, der ndiswrapper schein nicht mehr zu funktionieren. Habe...
  5. WLAN mit Ubuntu 8.10 und Ndiswrapper

    WLAN mit Ubuntu 8.10 und Ndiswrapper: [gelöst]WLAN mit Ubuntu 8.10 und Ndiswrapper Hallo und guten Abend (Nacht :-P) zusammen, ich habe ein Problem beim Herstellen einer Verbindung...