kernel-bau nicht aus /usr/src heraus ! uClinux

Dieses Thema im Forum "Installation & Basiskonfiguration" wurde erstellt von darmsinn89, 16.02.2009.

  1. #1 darmsinn89, 16.02.2009
    darmsinn89

    darmsinn89 Jungspund

    Dabei seit:
    11.02.2009
    Beiträge:
    13
    Zustimmungen:
    0
    Hallöchen!

    hab folgendes Problem:
    Code:
    config/mkconfig > Kconfig
    CC=cc CXX=c++ make -C /home/soeren/Palm-Linux/kernel/uClinux-dist/config/kconfig gconf
    make[1]: Betrete Verzeichnis '/home/soeren/Palm-Linux/kernel/uClinux-dist/config/kconfig'
    cc -DCURSES_LOC="<curses.h>" `pkg-config --cflags gtk+-2.0 gmodule-2.0 libglade-2.0` -D LKC_DIRECT_LINK  -c -o gconf.o gconf.c
    Package gtk+-2.0 was not found in the pkg-config search path.
    Perhaps you should add the directory containing `gtk+-2.0.pc'
    to the PKG_CONFIG_PATH environment variable
    No package 'gtk+-2.0' found
    Package gmodule-2.0 was not found in the pkg-config search path.
    Perhaps you should add the directory containing `gmodule-2.0.pc'
    to the PKG_CONFIG_PATH environment variable
    No package 'gmodule-2.0' found
    Package libglade-2.0 was not found in the pkg-config search path.
    Perhaps you should add the directory containing `libglade-2.0.pc'
    to the PKG_CONFIG_PATH environment variable
    No package 'libglade-2.0' found
    gconf.c:16:25: error: glade/glade.h: No such file or directory
    gconf.c:17:21: error: gtk/gtk.h: No such file or directory
    gconf.c:18:18: error: glib.h: No such file or directory
    gconf.c:19:28: error: gdk/gdkkeysyms.h: No such file or directory
    gconf.c:33: Fehler: expected »=«, »,«, »;«, »asm« or »__attribute__« before »view_mode«
    gconf.c:34: Fehler: expected »=«, »,«, »;«, »asm« or »__attribute__« before »show_name«
    gconf.c:35: Fehler: expected »=«, »,«, »;«, »asm« or »__attribute__« before »show_range«
    gconf.c:36: Fehler: expected »=«, »,«, »;«, »asm« or »__attribute__« before »show_value«
    gconf.c:37: Fehler: expected »=«, »,«, »;«, »asm« or »__attribute__« before »show_all«
    gconf.c:38: Fehler: expected »=«, »,«, »;«, »asm« or »__attribute__« before »show_debug«
    gconf.c:39: Fehler: expected »=«, »,«, »;«, »asm« or »__attribute__« before »resizeable«
    gconf.c:44: Fehler: expected »=«, »,«, »;«, »asm« or »__attribute__« before »*« token
    gconf.c:45: Fehler: expected »=«, »,«, »;«, »asm« or »__attribute__« before »*« token
    gconf.c:46: Fehler: expected »=«, »,«, »;«, »asm« or »__attribute__« before »*« token
    gconf.c:47: Fehler: expected »=«, »,«, »;«, »asm« or »__attribute__« before »*« token
    gconf.c:48: Fehler: expected »=«, »,«, »;«, »asm« or »__attribute__« before »*« token
    gconf.c:49: Fehler: expected »=«, »,«, »;«, »asm« or »__attribute__« before »*« token
    gconf.c:50: Fehler: expected »=«, »,«, »;«, »asm« or »__attribute__« before »*« token
    gconf.c:51: Fehler: expected »=«, »,«, »;«, »asm« or »__attribute__« before »*« token
    gconf.c:52: Fehler: expected »=«, »,«, »;«, »asm« or »__attribute__« before »*« token
    gconf.c:54: Fehler: expected »=«, »,«, »;«, »asm« or »__attribute__« before »*« token
    gconf.c:55: Fehler: expected »=«, »,«, »;«, »asm« or »__attribute__« before »color«
    gconf.c:57: Fehler: expected »=«, »,«, »;«, »asm« or »__attribute__« before »*« token
    gconf.c:58: Fehler: expected »=«, »,«, »;«, »asm« or »__attribute__« before »*« token
    gconf.c:59: Fehler: expected »=«, »,«, »;«, »asm« or »__attribute__« before »*« token
    gconf.c:60: Fehler: expected »=«, »,«, »;«, »asm« or »__attribute__« before »indent«
    gconf.c:75: Fehler: expected declaration specifiers or »...« before »GtkTreeIter«
    gconf.c:76: Fehler: expected »)« before »*« token
    gconf.c:77: Fehler: expected »=«, »,«, »;«, »asm« or »__attribute__« before »*« token
    gconf.c:173: Fehler: expected »)« before »*« token
    gconf.c:192: Fehler: expected »;«, »,« or »)« before »*« token
    gconf.c: In Funktion »init_tree_model«:
    gconf.c:283: Fehler: »gint« nicht deklariert (erste Benutzung in dieser Funktion)
    gconf.c:283: Fehler: (Jeder nicht deklarierte Bezeichner wird nur einmal aufgeführt
    gconf.c:283: Fehler: für jede Funktion in der er auftritt.)
    gconf.c:283: Fehler: expected »;« before »i«
    gconf.c:285: Fehler: »tree« nicht deklariert (erste Benutzung in dieser Funktion)
    gconf.c:285: Fehler: »tree2« nicht deklariert (erste Benutzung in dieser Funktion)
    gconf.c:286: Fehler: »G_TYPE_STRING« nicht deklariert (erste Benutzung in dieser Funktion)
    gconf.c:289: Fehler: »G_TYPE_POINTER« nicht deklariert (erste Benutzung in dieser Funktion)
    gconf.c:289: Fehler: »GDK_TYPE_COLOR« nicht deklariert (erste Benutzung in dieser Funktion)
    gconf.c:290: Fehler: »G_TYPE_BOOLEAN« nicht deklariert (erste Benutzung in dieser Funktion)
    gconf.c:290: Fehler: »GDK_TYPE_PIXBUF« nicht deklariert (erste Benutzung in dieser Funktion)
    gconf.c:294: Fehler: »model2« nicht deklariert (erste Benutzung in dieser Funktion)
    gconf.c:296: Fehler: »parents« nicht deklariert (erste Benutzung in dieser Funktion)
    gconf.c:296: Fehler: »i« nicht deklariert (erste Benutzung in dieser Funktion)
    gconf.c:297: Fehler: »GtkTreeIter« nicht deklariert (erste Benutzung in dieser Funktion)
    gconf.c:297: Fehler: expected expression before »)« token
    gconf.c:299: Fehler: »tree1« nicht deklariert (erste Benutzung in dieser Funktion)
    gconf.c:308: Fehler: »model1« nicht deklariert (erste Benutzung in dieser Funktion)
    gconf.c: In Funktion »init_left_tree«:
    gconf.c:313: Fehler: »GtkTreeView« nicht deklariert (erste Benutzung in dieser Funktion)
    gconf.c:313: Fehler: »view« nicht deklariert (erste Benutzung in dieser Funktion)
    gconf.c:313: Fehler: »tree1_w« nicht deklariert (erste Benutzung in dieser Funktion)
    gconf.c:314: Fehler: »GtkCellRenderer« nicht deklariert (erste Benutzung in dieser Funktion)
    gconf.c:314: Fehler: »renderer« nicht deklariert (erste Benutzung in dieser Funktion)
    gconf.c:315: Fehler: »GtkTreeSelection« nicht deklariert (erste Benutzung in dieser Funktion)
    gconf.c:315: Fehler: »sel« nicht deklariert (erste Benutzung in dieser Funktion)
    gconf.c:316: Fehler: »GtkTreeViewColumn« nicht deklariert (erste Benutzung in dieser Funktion)
    gconf.c:316: Fehler: »column« nicht deklariert (erste Benutzung in dieser Funktion)
    gconf.c:318: Fehler: »model1« nicht deklariert (erste Benutzung in dieser Funktion)
    gconf.c:319: Fehler: »TRUE« nicht deklariert (erste Benutzung in dieser Funktion)
    gconf.c:320: Fehler: »FALSE« nicht deklariert (erste Benutzung in dieser Funktion)
    gconf.c:345: Fehler: »GTK_SELECTION_SINGLE« nicht deklariert (erste Benutzung in dieser Funktion)
    gconf.c: Auf höchster Ebene:
    gconf.c:349: Fehler: expected »)« before »*« token
    gconf.c:352: Fehler: expected »)« before »*« token
    gconf.c: In Funktion »init_right_tree«:
    gconf.c:357: Fehler: »GtkTreeView« nicht deklariert (erste Benutzung in dieser Funktion)
    gconf.c:357: Fehler: »view« nicht deklariert (erste Benutzung in dieser Funktion)
    gconf.c:357: Fehler: »tree2_w« nicht deklariert (erste Benutzung in dieser Funktion)
    gconf.c:358: Fehler: »GtkCellRenderer« nicht deklariert (erste Benutzung in dieser Funktion)
    gconf.c:358: Fehler: »renderer« nicht deklariert (erste Benutzung in dieser Funktion)
    gconf.c:359: Fehler: »GtkTreeSelection« nicht deklariert (erste Benutzung in dieser Funktion)
    gconf.c:359: Fehler: »sel« nicht deklariert (erste Benutzung in dieser Funktion)
    gconf.c:360: Fehler: »GtkTreeViewColumn« nicht deklariert (erste Benutzung in dieser Funktion)
    gconf.c:360: Fehler: »column« nicht deklariert (erste Benutzung in dieser Funktion)
    gconf.c:361: Fehler: »gint« nicht deklariert (erste Benutzung in dieser Funktion)
    gconf.c:361: Fehler: expected »;« before »i«
    gconf.c:363: Fehler: »model2« nicht deklariert (erste Benutzung in dieser Funktion)
    gconf.c:364: Fehler: »TRUE« nicht deklariert (erste Benutzung in dieser Funktion)
    gconf.c:365: Fehler: »FALSE« nicht deklariert (erste Benutzung in dieser Funktion)
    gconf.c:431: Fehler: »renderer_edited« nicht deklariert (erste Benutzung in dieser Funktion)
    gconf.c:434: Fehler: »show_name« nicht deklariert (erste Benutzung in dieser Funktion)
    gconf.c:436: Fehler: »show_range« nicht deklariert (erste Benutzung in dieser Funktion)
    gconf.c:442: Fehler: »show_value« nicht deklariert (erste Benutzung in dieser Funktion)
    gconf.c:444: Fehler: »resizeable« nicht deklariert (erste Benutzung in dieser Funktion)
    gconf.c:445: Fehler: »i« nicht deklariert (erste Benutzung in dieser Funktion)
    gconf.c:452: Fehler: »GTK_SELECTION_SINGLE« nicht deklariert (erste Benutzung in dieser Funktion)
    gconf.c: In Funktion »text_insert_help«:
    gconf.c:461: Fehler: »GtkTextBuffer« nicht deklariert (erste Benutzung in dieser Funktion)
    gconf.c:461: Fehler: »buffer« nicht deklariert (erste Benutzung in dieser Funktion)
    gconf.c:462: Fehler: »GtkTextIter« nicht deklariert (erste Benutzung in dieser Funktion)
    gconf.c:462: Fehler: expected »;« before »start«
    gconf.c:464: Fehler: »gchar« nicht deklariert (erste Benutzung in dieser Funktion)
    gconf.c:464: Fehler: »name« nicht deklariert (erste Benutzung in dieser Funktion)
    gconf.c:477: Fehler: »text_w« nicht deklariert (erste Benutzung in dieser Funktion)
    gconf.c:478: Fehler: »start« nicht deklariert (erste Benutzung in dieser Funktion)
    gconf.c:478: Fehler: »end« nicht deklariert (erste Benutzung in dieser Funktion)
    gconf.c:483: Fehler: »tag1« nicht deklariert (erste Benutzung in dieser Funktion)
    gconf.c:491: Fehler: »tag2« nicht deklariert (erste Benutzung in dieser Funktion)
    gconf.c: In Funktion »text_insert_msg«:
    gconf.c:498: Fehler: »GtkTextBuffer« nicht deklariert (erste Benutzung in dieser Funktion)
    gconf.c:498: Fehler: »buffer« nicht deklariert (erste Benutzung in dieser Funktion)
    gconf.c:499: Fehler: »GtkTextIter« nicht deklariert (erste Benutzung in dieser Funktion)
    gconf.c:499: Fehler: expected »;« before »start«
    gconf.c:502: Fehler: »text_w« nicht deklariert (erste Benutzung in dieser Funktion)
    gconf.c:503: Fehler: »start« nicht deklariert (erste Benutzung in dieser Funktion)
    gconf.c:503: Fehler: »end« nicht deklariert (erste Benutzung in dieser Funktion)
    gconf.c:508: Fehler: »tag1« nicht deklariert (erste Benutzung in dieser Funktion)
    gconf.c:512: Fehler: »tag2« nicht deklariert (erste Benutzung in dieser Funktion)
    gconf.c: Auf höchster Ebene:
    gconf.c:519: Fehler: expected »)« before »*« token
    gconf.c:520: Fehler: expected »=«, »,«, »;«, »asm« or »__attribute__« before »on_window1_delete_event«
    gconf.c:565: Fehler: expected »)« before »*« token
    gconf.c:572: Fehler: expected »)« before »*« token
    gconf.c:595: Fehler: expected »)« before »*« token
    gconf.c:608: Fehler: expected »)« before »*« token
    gconf.c:628: Fehler: expected »)« before »*« token
    gconf.c:636: Fehler: expected »)« before »*« token
    gconf.c:649: Fehler: expected »)« before »*« token
    gconf.c:669: Fehler: expected »)« before »*« token
    gconf.c:676: Fehler: expected »)« before »*« token
    gconf.c:687: Fehler: expected »)« before »*« token
    gconf.c:705: Fehler: expected »)« before »*« token
    gconf.c:717: Fehler: expected »)« before »*« token
    gconf.c:727: Fehler: expected »)« before »*« token
    gconf.c:734: Fehler: expected »)« before »*« token
    gconf.c:766: Fehler: expected »)« before »*« token
    gconf.c:784: Fehler: expected »)« before »*« token
    gconf.c:803: Fehler: expected »)« before »*« token
    gconf.c:818: Fehler: expected »)« before »*« token
    gconf.c:824: Fehler: expected »)« before »*« token
    gconf.c:834: Fehler: expected »)« before »*« token
    gconf.c:850: Fehler: expected »)« before »*« token
    gconf.c:862: Fehler: expected »)« before »*« token
    gconf.c:868: Fehler: expected »)« before »*« token
    gconf.c:877: Fehler: expected »)« before »*« token
    gconf.c:904: Fehler: expected declaration specifiers or »...« before »gint«
    gconf.c: In Funktion »change_sym_value«:
    gconf.c:912: Fehler: »col« nicht deklariert (erste Benutzung in dieser Funktion)
    gconf.c:928: Fehler: »view_mode« nicht deklariert (erste Benutzung in dieser Funktion)
    gconf.c:929: Fehler: zu viele Argumente für Funktion »update_tree«
    gconf.c:931: Fehler: zu viele Argumente für Funktion »update_tree«
    gconf.c: In Funktion »toggle_sym_value«:
    gconf.c:951: Fehler: »view_mode« nicht deklariert (erste Benutzung in dieser Funktion)
    gconf.c:952: Fehler: zu viele Argumente für Funktion »update_tree«
    gconf.c:954: Fehler: zu viele Argumente für Funktion »update_tree«
    gconf.c: Auf höchster Ebene:
    gconf.c:961: Fehler: expected »)« before »*« token
    gconf.c:990: Fehler: expected »=«, »,«, »;«, »asm« or »__attribute__« before »column2index«
    gconf.c:1008: Fehler: expected »=«, »,«, »;«, »asm« or »__attribute__« before »on_treeview2_button_press_event«
    gconf.c:1018:22: error: missing binary operator before token "("
    gconf.c:1065: Fehler: expected »=«, »,«, »;«, »asm« or »__attribute__« before »on_treeview2_key_press_event«
    gconf.c:1110: Fehler: expected »)« before »*« token
    gconf.c:1126: Fehler: expected »=«, »,«, »;«, »asm« or »__attribute__« before »on_treeview1_button_press_event«
    gconf.c:1165: Fehler: expected »=«, »,«, »;«, »asm« or »__attribute__« before »*« token
    gconf.c:1286: Fehler: expected »)« before »*« token
    gconf.c: In Funktion »place_node«:
    gconf.c:1324: Fehler: »GtkTreeIter« nicht deklariert (erste Benutzung in dieser Funktion)
    gconf.c:1324: Fehler: »parent« nicht deklariert (erste Benutzung in dieser Funktion)
    gconf.c:1324: Fehler: »parents« nicht deklariert (erste Benutzung in dieser Funktion)
    gconf.c:1324: Fehler: »indent« nicht deklariert (erste Benutzung in dieser Funktion)
    gconf.c:1325: Fehler: »node« nicht deklariert (erste Benutzung in dieser Funktion)
    gconf.c:1327: Fehler: »tree« nicht deklariert (erste Benutzung in dieser Funktion)
    gconf.c: Auf höchster Ebene:
    gconf.c:1333: Fehler: expected »=«, »,«, »;«, »asm« or »__attribute__« before »found«
    gconf.c:1338: Fehler: expected »=«, »,«, »;«, »asm« or »__attribute__« before »*« token
    gconf.c:1372: Fehler: expected declaration specifiers or »...« before »GtkTreeIter«
    gconf.c: In Funktion »update_tree«:
    gconf.c:1375: Fehler: »GtkTreeIter« nicht deklariert (erste Benutzung in dieser Funktion)
    gconf.c:1375: Fehler: expected »;« before »iter«
    gconf.c:1376: Fehler: »child2« nicht deklariert (erste Benutzung in dieser Funktion)
    gconf.c:1376: Fehler: »iter« nicht deklariert (erste Benutzung in dieser Funktion)
    gconf.c:1377: Fehler: »gboolean« nicht deklariert (erste Benutzung in dieser Funktion)
    gconf.c:1377: Fehler: expected »;« before »valid«
    gconf.c:1378: Fehler: »sibling« nicht deklariert (erste Benutzung in dieser Funktion)
    gconf.c:1384: Fehler: »indent« nicht deklariert (erste Benutzung in dieser Funktion)
    gconf.c:1386: Fehler: »valid« nicht deklariert (erste Benutzung in dieser Funktion)
    gconf.c:1386: Fehler: »model2« nicht deklariert (erste Benutzung in dieser Funktion)
    gconf.c:1386: Fehler: »dst« nicht deklariert (erste Benutzung in dieser Funktion)
    gconf.c:1406: Fehler: »show_all« nicht deklariert (erste Benutzung in dieser Funktion)
    gconf.c:1407: Warnung: Vergleich zwischen Zeiger und Ganzzahl
    gconf.c:1408: Fehler: »tmp« nicht deklariert (erste Benutzung in dieser Funktion)
    gconf.c:1411: Fehler: »tree2« nicht deklariert (erste Benutzung in dieser Funktion)
    gconf.c:1421: Warnung: Vergleich zwischen Zeiger und Ganzzahl
    gconf.c:1431: Fehler: »TRUE« nicht deklariert (erste Benutzung in dieser Funktion)
    gconf.c:1447: Fehler: zu viele Argumente für Funktion »update_tree«
    gconf.c: In Funktion »display_tree«:
    gconf.c:1464: Fehler: »indent« nicht deklariert (erste Benutzung in dieser Funktion)
    gconf.c:1476: Fehler: »view_mode« nicht deklariert (erste Benutzung in dieser Funktion)
    gconf.c:1477: Fehler: »tree« nicht deklariert (erste Benutzung in dieser Funktion)
    gconf.c:1477: Fehler: »tree1« nicht deklariert (erste Benutzung in dieser Funktion)
    gconf.c:1481: Fehler: »tree2« nicht deklariert (erste Benutzung in dieser Funktion)
    gconf.c:1484: Fehler: »show_all« nicht deklariert (erste Benutzung in dieser Funktion)
    gconf.c:1485: Warnung: Übergabe des Arguments 2 von »place_node« erzeugt Zeiger von Ganzzahl ohne Typkonvertierung
    gconf.c: In Funktion »display_tree_part«:
    gconf.c:1519: Fehler: »tree2« nicht deklariert (erste Benutzung in dieser Funktion)
    gconf.c:1521: Fehler: »view_mode« nicht deklariert (erste Benutzung in dieser Funktion)
    gconf.c:1525: Fehler: »tree2_w« nicht deklariert (erste Benutzung in dieser Funktion)
    gconf.c: In Funktion »display_list«:
    gconf.c:1531: Fehler: »tree1« nicht deklariert (erste Benutzung in dieser Funktion)
    gconf.c:1534: Fehler: »tree« nicht deklariert (erste Benutzung in dieser Funktion)
    gconf.c:1536: Fehler: »tree1_w« nicht deklariert (erste Benutzung in dieser Funktion)
    gconf.c:1537: Fehler: »tree2« nicht deklariert (erste Benutzung in dieser Funktion)
    gconf.c: In Funktion »main«:
    gconf.c:1562: Fehler: »gchar« nicht deklariert (erste Benutzung in dieser Funktion)
    gconf.c:1562: Fehler: »glade_file« nicht deklariert (erste Benutzung in dieser Funktion)
    gconf.c:1614: Fehler: »view_mode« nicht deklariert (erste Benutzung in dieser Funktion)
    gconf.c: In Funktion »conf_changed«:
    gconf.c:1634: Fehler: »save_btn« nicht deklariert (erste Benutzung in dieser Funktion)
    gconf.c:1635: Fehler: »save_menu_item« nicht deklariert (erste Benutzung in dieser Funktion)
    make[1]: *** [gconf.o] Fehler 1
    make[1]: Verlasse Verzeichnis '/home/soeren/Palm-Linux/kernel/uClinux-dist/config/kconfig'
    make: *** [/home/soeren/Palm-Linux/kernel/uClinux-dist/config/kconfig/gconf] Fehler 2
    
    ok, jetz hab ich erst ma den das prompt hier dumpf hingeklatscht....


    also, es geht einfach nur darum ein fertiges uClinux-image zu basteln...compiler und so hab ich ja schon längst, bloß hakt es am xconfig....
    ich hab das uclinux in einem anderen ordner liegen als /usr/src...wenn ich aber in usr/src/linux-source-2.6.27 "make xconfig" eingebe klappt alles wie am schnürchen...

    hab ich vielleicht im uclinux-ordner kaputte dateien oder fehlen welche?
    oder muss ich vielleicht noch ./configure vor make xconfig machen? nee, oder? kann ja eigentlich gar nich sein...


    ich hoffe ihr könnt mir helfen!
    Sören
     
  2. Anzeige

    Schau dir mal diese Kategorie an. Dort findest du bestimmt etwas.
    Registrieren bzw. einloggen, um diese und auch andere Anzeigen zu deaktivieren
  3. #2 bitmuncher, 16.02.2009
    bitmuncher

    bitmuncher Der Stillgelegte

    Dabei seit:
    08.05.2007
    Beiträge:
    3.171
    Zustimmungen:
    0
    Du solltest nicht 'make gconfig' aufrufen, wenn du kein Gnome bzw. die zugehörigen Devel-Pakete installiert hast.
     
  4. #3 darmsinn89, 16.02.2009
    darmsinn89

    darmsinn89 Jungspund

    Dabei seit:
    11.02.2009
    Beiträge:
    13
    Zustimmungen:
    0
    ..ich hab gnome! was gibt es noch für möglichkeiten woran es liegen könnte? die ersten paar zeilen der fehlerausgabe sind doch die eigentlichen hinweise, oder?
     
  5. #4 bitmuncher, 16.02.2009
    bitmuncher

    bitmuncher Der Stillgelegte

    Dabei seit:
    08.05.2007
    Beiträge:
    3.171
    Zustimmungen:
    0
    Du hast aber scheinbar die Devel-Pakete für libglade, gtk+-2.0 und gmodule nicht installiert.
     
  6. #5 darmsinn89, 16.02.2009
    darmsinn89

    darmsinn89 Jungspund

    Dabei seit:
    11.02.2009
    Beiträge:
    13
    Zustimmungen:
    0
    ok, ich habs...musste die ne dev-lib installieren...

    CLOSED !
     
Thema:

kernel-bau nicht aus /usr/src heraus ! uClinux

Die Seite wird geladen...

kernel-bau nicht aus /usr/src heraus ! uClinux - Ähnliche Themen

  1. PATH wird nicht richtig durchsucht

    PATH wird nicht richtig durchsucht: Hi zusammen, ich nutze das Forum schon seit längerem , allerdings hat mir bis jetzt immer die Suchfunktion weitergeholfen. Bei meinem aktuellen...
  2. SRV Records nicht erstellt nach dcpromo

    SRV Records nicht erstellt nach dcpromo: Hallo zusammen, leider sind beim Join meines 2. DC in eine Samba 4 Domäne die SRV-DNS Records nicht erstellt worden... Hatte jemand schonmal das...
  3. Port generieren, wenn nicht dann

    Port generieren, wenn nicht dann: Hey Leute, ich hänge ein wenig an einem Problem. Der User kann einen port frei wählen. Also SSH_USERPORT="" Nun habe ich aber eine.hand voll...
  4. Kabel I-net geht auf Arbeit aber nicht Zuhause

    Kabel I-net geht auf Arbeit aber nicht Zuhause: Hallo liebe Liebenden & Haters dieser Welt, ich komme bei mir zuhause nicht ins Internet via Ethernet-Kabel. Es handelt sich um einen Laptop, der...
  5. [Erledigt] Shell-Skript lässt sich nicht mit Cron ausführen

    [Erledigt] Shell-Skript lässt sich nicht mit Cron ausführen: Hallo, ich hoffe ihr könnt mir helfen. Ich entwerfe im Moment ein Skript, welches den Callmonitor (Telnet) auf meiner FritzBox abfragt und wenn...