fehler beim treiber compilieren

Dieses Thema im Forum "Internet, lokale Netzwerke und Wireless Lan" wurde erstellt von sono, 11.05.2005.

  1. sono

    sono Sack Flöhe Hüter

    Dabei seit:
    31.01.2004
    Beiträge:
    1.299
    Zustimmungen:
    0
    Ort:
    http://webfrap.de
    Eigentlich habe ich alles so gemacht wie in dem readme und die kernelquellen sind auch da wo Sie sein sollten.

    Kann mir jemand sagen wo da das problem hängt ?

    Debian testing
    SIS162 wireless lan chipsatz, treiber von sis seite
    kernel 2.6.10



    solap:/home/sono/alien/SiS162-Driver# sh ./Install


    -------- SiS162 Linux Configuration Script --------

    Linux kernel source directory [/usr/src/linux-2.6.10]: /usr/src/linux

    The kernel source tree is version 2.6.10.
    The current kernel build date is Sat Apr 2 12:02:56 2005.
    Module install directory [/lib/modules/2.6.10]:

    Choice install device (USB/PCI) [USB]: PCI
    Selected PCI device

    expr: Syntaxfehler
    ./Configure: line 273: [: 131413: unary operator expected
    Checking configuration output file...

    Configuration successful.

    Checking SiS162 linux driver source...


    Compiling SiS162 modules...

    gcc -D__KERNEL__ -Wstrict-prototypes -pipe -DMODULE -O2 -fomit-frame-pointer -DMODVERSIONS -DEXPORT_SYMTAB -include/usr/src/linux/include/linux/modversions.h -I./ -I../include/static -I../nsm -I/usr/src/linux/include -I../include -ffixed-8 -c -o release/sis.o release/sis.c
    <Kommandozeile>:138473843:61880: /usr/src/linux/include/linux/modversions.h: Datei oder Verzeichnis nicht gefunden
    In file included from release/sis.c:21:
    /usr/src/linux/include/linux/ac97_codec.h:218: error: field `list' has incomplete type
    /usr/src/linux/include/linux/ac97_codec.h:247: error: Fehler beim Parsen before "spinlock_t"
    /usr/src/linux/include/linux/ac97_codec.h:247: Warnung: kein Semikolon am Ende von »struct« oder »union«
    /usr/src/linux/include/linux/ac97_codec.h:272: error: Fehler beim Parsen before '}' token
    /usr/src/linux/include/linux/ac97_codec.h:307: error: field `list' has incomplete type
    release/sis.c:51:26: linux/tqueue.h: Datei oder Verzeichnis nicht gefunden
    release/sis.c:79:26: linux/tqueue.h: Datei oder Verzeichnis nicht gefunden
    In Datei, eingefügt von /usr/src/linux/include/linux/irq.h:21,
    von /usr/src/linux/include/asm/hardirq.h:6,
    von /usr/src/linux/include/linux/hardirq.h:6,
    von /usr/src/linux/include/linux/interrupt.h:11,
    von /usr/src/linux/include/linux/netdevice.h:518,
    von release/sis.c:86:
    /usr/src/linux/include/asm/irq.h:16:25: irq_vectors.h: Datei oder Verzeichnis nicht gefunden
    In file included from /usr/src/linux/include/asm/hardirq.h:6,
    from /usr/src/linux/include/linux/hardirq.h:6,
    from /usr/src/linux/include/linux/interrupt.h:11,
    from /usr/src/linux/include/linux/netdevice.h:518,
    from release/sis.c:86:
    /usr/src/linux/include/linux/irq.h:71: error: `NR_IRQS' undeclared here (not in a function)
    In file included from /usr/src/linux/include/linux/irq.h:73,
    from /usr/src/linux/include/asm/hardirq.h:6,
    from /usr/src/linux/include/linux/hardirq.h:6,
    from /usr/src/linux/include/linux/interrupt.h:11,
    from /usr/src/linux/include/linux/netdevice.h:518,
    from release/sis.c:86:
    /usr/src/linux/include/asm/hw_irq.h:28: error: `NR_IRQ_VECTORS' undeclared here (not in a function)
    /usr/src/linux/include/asm/hw_irq.h:32: error: `NR_IRQS' undeclared here (not in a function)
    In file included from /usr/src/linux/include/asm/hardirq.h:6,
    from /usr/src/linux/include/linux/hardirq.h:6,
    from /usr/src/linux/include/linux/interrupt.h:11,
    from /usr/src/linux/include/linux/netdevice.h:518,
    from release/sis.c:86:
    /usr/src/linux/include/linux/irq.h:78: error: `NR_IRQS' undeclared here (not in a function)
    release/sis.c:105: error: Fehler beim Parsen before '*' token
    release/sis.c:105: error: Fehler beim Parsen before '*' token
    release/sis.c:105: Warnung: function declaration isn't a prototype
    release/sis.c:105: Warnung: data definition has no type or storage class
    release/sis.c:106: error: Fehler beim Parsen before '*' token
    release/sis.c:106: Warnung: function declaration isn't a prototype
    release/sis.c:107: error: Fehler beim Parsen before '*' token
    release/sis.c:107: Warnung: function declaration isn't a prototype
    release/sis.c:108: error: Fehler beim Parsen before '*' token
    release/sis.c:108: Warnung: function declaration isn't a prototype
    release/sis.c:250: Warnung: static declaration for `no_llseek' follows non-static
    release/sis.c: In Funktion »sis_request_irq«:
    release/sis.c:489: Warnung: Verarbeiten des Argumentes 2 von »request_irq« von inkompatiblem Zeigertyp
    release/sis.c: In Funktion »sis_check_region«:
    release/sis.c:747: Warnung: `check_region' is deprecated (declared at /usr/src/linux/include/linux/ioport.h:126)
    release/sis.c: In Funktion »sis_pci_set_drvdata«:
    release/sis.c:997: error: structure has no member named `driver_data'
    release/sis.c: In Funktion »sis_pci_get_drvdata«:
    release/sis.c:1001: error: structure has no member named `driver_data'
    release/sis.c: In Funktion »sis_tq_init«:
    release/sis.c:1283: error: invalid application of `sizeof' to an incomplete typerelease/sis.c: In Funktion »sis_tq_set«:
    release/sis.c:1300: error: dereferencing pointer to incomplete type
    release/sis.c:1301: error: dereferencing pointer to incomplete type
    release/sis.c:1302: error: dereferencing pointer to incomplete type
    release/sis.c: In Funktion »sis_queue_task«:
    release/sis.c:1308: error: `tq_immediate' undeclared (first use in this function)
    release/sis.c:1308: error: (Each undeclared identifier is reported only once
    release/sis.c:1308: error: for each function it appears in.)
    release/sis.c: In Funktion »sis_run_task_queue«:
    release/sis.c:1312: error: `tq_immediate' undeclared (first use in this function)
    release/sis.c: In Funktion »sis_mark_bh«:
    release/sis.c:1316: error: `IMMEDIATE_BH' undeclared (first use in this function)
    make: *** [release/sis.o] Fehler 1
    Compile ./release/sis.o failed !

    SiS162 module install failed !

    solap:/home/sono/alien/SiS162-Driver#
     
  2. Anzeige

    Schau dir mal diese Kategorie an. Dort findest du bestimmt etwas.
    Registrieren bzw. einloggen, um diese und auch andere Anzeigen zu deaktivieren
Thema:

fehler beim treiber compilieren

Die Seite wird geladen...

fehler beim treiber compilieren - Ähnliche Themen

  1. Ubuntu fehler beim instalieren

    Ubuntu fehler beim instalieren: Hallo Ich wollte auf meinem Pc Ubuntu neben Windows instalieren da ich hörte ist besser geignet für steam games. Ich habe mir deshalb auf einem...
  2. fstab: Netzlaufwerk beim Booten einbinden verursacht Fehler

    fstab: Netzlaufwerk beim Booten einbinden verursacht Fehler: Ich benutze davfs2, um ein WebDAV-Verzeichnis einzubinden. Wenn ich folgenden Eintrag in meine fstab schreibe, kann ich das Verzeichnis wunderbar...
  3. KSH: Problem beim Umleiten des Fehlerkanals

    KSH: Problem beim Umleiten des Fehlerkanals: Hallo, in einen KSH Skript führe ich folgende Befehle aus RESULT=""; ERROR=""; idsldapsearch -h localhost -p $PORT -D $USER -w $PW -s sub -b...
  4. Fehlermeldung beim SSH-Login / Server nicht mehr erreichbar

    Fehlermeldung beim SSH-Login / Server nicht mehr erreichbar: Hallo, nach einem Neustart ist mein Lenny (Root-Server bei Hetzner) leider nicht mehr so richtig aufgewacht. Die Symptome: - Websites sind...
  5. VirtualBox Fehler beim Installieren

    VirtualBox Fehler beim Installieren: Hallo zusammen Ich habe mir das Fedora 15 aufegspielt und wollte mir heute mal die Virtualbox installieren. Lerider bekomme ich immer ein Fehler...