Compiler Problem: cannot find -lexpat collect2: ld returned 1 exit status

Dieses Thema im Forum "Linux OS" wurde erstellt von tuxlover, 06.12.2007.

  1. #1 tuxlover, 06.12.2007
    tuxlover

    tuxlover Der den Tux knuddelt

    Dabei seit:
    26.10.2005
    Beiträge:
    2.106
    Zustimmungen:
    0
    Ort:
    berlin
    hallo liebe leute,

    ich kriege in letzter zeit immer probleme beim kompillieren von Programmen aus dem Sourcecode. Und zwar taucht dann zumeist bei kde applikationen folgende Fehlermeldung auf:

    wie z.B. bei kirocker

    Code:
    *** Warning: Linking the executable kirocker against the loadable module
    *** kirocker_panelapplet.so is not portable!
    /usr/lib/gcc/i586-suse-linux/4.1.2/../../../../i586-suse-linux/bin/ld: cannot find -lexpat
    collect2: ld returned 1 exit status
    make[2]: *** [kirocker] Fehler 1
    make[2]: Leaving directory `/home/matthias/Downloads/NewSoftware/kirocker-4.0/src'
    make[1]: *** [all-recursive] Fehler 1
    make[1]: Leaving directory `/home/matthias/Downloads/NewSoftware/kirocker-4.0'
    make: *** [all] Fehler 2
    
    jaja ich weiß, dass es das schon längst als rpm gibt. Aber das ist z.B. ein Programm bei dem ich nie Probleme hatte, das durchzukompillieren und dieses Problem taucht nicht nur dort auf. Das kann ja kein Zufall sein, dass egal was ich kompillieren will, der Prozess an genau der gleichen Stelle mit der gleichen Fehlermeldung abbricht.

    Weiß jemand rat.

    ich habe
    automake 1.10
    autoconf 2.60
    make 3.81
    cmake 2.4.7
    gcc 4.1.3

    greetz tuxlover
     
  2. Anzeige

    Schau dir mal diese Kategorie an. Dort findest du bestimmt etwas.
    Registrieren bzw. einloggen, um diese und auch andere Anzeigen zu deaktivieren
  3. #2 Bâshgob, 06.12.2007
    Bâshgob

    Bâshgob freies Radikal

    Dabei seit:
    29.07.2004
    Beiträge:
    2.334
    Zustimmungen:
    0
    Ort:
    Hannover
    Fehlt dir eine lib?

    Code:
    [B]cannot find -lexpat[/B]
    collect2: ld returned 1 exit status
    deutet auf diese Möglichkeit hin.
     
  4. #3 tuxlover, 06.12.2007
    tuxlover

    tuxlover Der den Tux knuddelt

    Dabei seit:
    26.10.2005
    Beiträge:
    2.106
    Zustimmungen:
    0
    Ort:
    berlin
    ja und welche könnte das sein?
     
  5. #4 Bâshgob, 06.12.2007
    Bâshgob

    Bâshgob freies Radikal

    Dabei seit:
    29.07.2004
    Beiträge:
    2.334
    Zustimmungen:
    0
    Ort:
    Hannover
    Vermutlich expat, genaueres werden dir aber sicher configure und das dazugehörige Log verraten können.
     
  6. doc

    doc Kaffeetrinker

    Dabei seit:
    26.08.2006
    Beiträge:
    586
    Zustimmungen:
    0
    Ort:
    bremen
    vieleicht letztens libtool geupgradet ?

    "libtool" war jedenfalls mein erster Gedanke als ich die Fehlermeldung gesehen habe (tut mir leid kann das nich begründen), aber ich glaube ich hatte bei gentoo mal so ein problem.
     
  7. Anzeige

    Vielleicht findest du HIER Antworten.
    Registrieren bzw. einloggen, um diese und auch andere Anzeigen zu deaktivieren
  8. #6 tuxlover, 06.12.2007
    Zuletzt bearbeitet: 06.12.2007
    tuxlover

    tuxlover Der den Tux knuddelt

    Dabei seit:
    26.10.2005
    Beiträge:
    2.106
    Zustimmungen:
    0
    Ort:
    berlin
    nö libtool habe ich nicht geupdate. ist immer noch die drauf die mit der originaldistri kam. expat ist installiert, wurde auch geupdate. kann das aber nicht wieder downgraden,weil da ein ganzer schlauch von abhängigkeiten dran hängt.
    .
    .
    .
    EDIT (autom. Beitragszusammenführung) :
    .

    so habe jetzt aus dem source-rpm nochmal neues expat rpm gebaut und installiert. jetzt klappt alles wieder wunderbar.

    danke für eure mühe
     
  9. #7 Bâshgob, 06.12.2007
    Bâshgob

    Bâshgob freies Radikal

    Dabei seit:
    29.07.2004
    Beiträge:
    2.334
    Zustimmungen:
    0
    Ort:
    Hannover
    Immer wieder gerne :-)
     
Thema:

Compiler Problem: cannot find -lexpat collect2: ld returned 1 exit status

Die Seite wird geladen...

Compiler Problem: cannot find -lexpat collect2: ld returned 1 exit status - Ähnliche Themen

  1. Compiler-Problem

    Compiler-Problem: Hi, ich versuche jetzt schon ziemlich lang, aber mein Compiler spuckt immer komische Sachen aus, und ich weiss net wieso. #include <stdio.h>...
  2. Compiler Problem

    Compiler Problem: Ich habe folgenden Source Code, und kann den irgendwie net kompilieren, Compiler gibt immer Fehler aus, wo meiner Meinung nach keine sind....
  3. Problem mit Compiler bei ./configure... x includes

    Problem mit Compiler bei ./configure... x includes: Hi, also ich hab folgendes Problem... wollte ein Theme für KDE compilieren, hab also entpackt, bin mit der Konsole in den Ordner und gab den Code...
  4. Problem mit dem C Compiler

    Problem mit dem C Compiler: Da KXDocker auf Edgy nicht mehr wirklich laufen soll, wollte ich alternativ dann KSmoothDock installieren. Bei der Installation kam dann jedoch...
  5. Ubuntu Neuling hat Probleme mit MP3s und C++ Compiler!

    Ubuntu Neuling hat Probleme mit MP3s und C++ Compiler!: Hallo ich habe mir mal das neue Ubuntu 6.10 runtergeladen und habe nun 2 Probleme: 1.) Wie kann ich meinem Ubuntu beibringen MP3s abzuspielen?...